{"text_format":"1","workbook":"xlsx","n_sheets":16,"sheets":["Welcome","Macros","Mowing Scenario","Calculations","Factors","Results","Scenarios","Scenarios (2)","Native Vegetation","Grasscycling","Maintenance","Mowing","Native Vegetation (2)","Grasscycling (2)","Maintenance (2)","Mowing (2)"],"not_rendered":{"charts":6,"images":12,"macros":1,"external_links":0,"defined_names":51,"comments":0,"pivot_tables":0},"unopened":[],"bounds":{"document_bytes":16777216,"sheet_cells":100000,"rows_first":2000,"rows_last":500,"rows_between":2000,"halvings":0,"cell_chars":16384,"cell_head_chars":4096},"cells_cut":0,"cells_raw":0,"read":"whole","date_system":"1900"}

{"sheet":"Welcome","index":0,"n_rows":42,"n_cols":14,"rows_kept":42,"cut":false,"hidden":false,"merged":[[1,13,3,15],[11,1,11,10],[11,12,15,16],[17,1,19,10]]}
[]
[null,null,null,null,null,null,null,null,null,null,null,null,null,"Use these buttons at any point to save the calculator to your computer."]
[]
[]
[]
[]
[]
[]
[null,"Welcome to Pennsylvania's Mowing Calculator!"]
[null,"Best practices for managing mowed areas."]
[]
[null,"This calculator has been created for public and private land owners who regularly care for lawns.  This tool calculates fuel, dollar, greenhouse gas (GHG), and other savings associated with changing current mowing practices.",null,null,null,null,null,null,null,null,null,null,"Please note: Before you begin, you should save the Mowing Calculator file to your computer and enable macros.  Macros are programming rules that run Mowing Calculator features. Depending on your computer's security settings they may be disabled. Macros in this file will not harm your computer."]
[null,"Establishing a new approach for managing a lawn can lead to:"]
[null,"• A healthier and more attractive lawn,"]
[null,"• Improved air and water quality,"]
[null,"• Money and time that will be available for other maintenance needs."]
[null,null,null,null,null,null,null,null,null,null,null,null,"Click here to learn more…"]
[null,"This calculator presents best practices pertaining to Native Vegetation, Grass Cycling, Mower Maintenance, and Mowing.  To access information on these topics click the buttons below. To access the calculator click the orange arrow above."]
[null,null,null,null,null,null,null,null,null,null,null,null,"Have questions?  Contact:"]
[null,null,null,null,null,null,null,null,null,null,null,null,"Ashley Rebert"]
[null,null,null,null,null,null,null,null,null,null,null,null,"Department of Conservation and Natural Resources"]
[null,null,null,null,null,null,null,null,null,null,null,null,"Bureau of Recreation and Conservation"]
[null,null,null,null,null,null,null,null,null,null,null,null,"arebert@pa.gov"]
[null,null,null,null,null,null,null,null,null,null,null,null,"https://www.dcnr.pa.gov/about/Pages/Recreation-and-Conservation.aspx"]
[]
[]
[]
[]
[]
[]
[]
[]
[]
[]
[]
[]
[]
[]
[null,"Prepared for PA DCNR and PRPS by:"]
[]
[]
[null,null,"v 1.0"]

{"sheet":"Macros","index":1,"n_rows":120,"n_cols":2,"rows_kept":120,"cut":false,"hidden":false,"merged":[[5,1,7,12]]}
[]
[null,"Enable macros before you begin"]
[]
[]
[]
[null,"To use the Mowing Calculator, you must save the Mowing Calculator file to your computer and enable macros if they aren't already."]
[]
[]
[]
[null,"Depending on your security settings, opening the Mowing Calculator from a web browser or email may disable macros.  "]
[]
[null,"Macros are programming rules that execute some Mowing Calculator functions."]
[null,"If macros aren't enabled, the Mowing Calculator will not function properly."]
[]
[null,"You should therefore save the file to a folder before opening and enable macros before using the Calculator."]
[]
[null,"To enable macros:"]
[null,"When opening the Mowing Calculator, click the \"Enable Content\" button."]
[]
[]
[]
[]
[]
[]
[]
[]
[]
[]
[]
[]
[]
[]
[]
[]
[]
[]
[]
[]
[]
[]
[]
[null,"If you do not see an Enable Content button,"]
[null,"1) Close the Mowing Calculator and reopen Excel."]
[null,"2a) In Microsoft Excel 2010 and 2013, click the File tab and click on \"Options\" near the bottom of the panel."]
[null,"2b) In Microsoft Excel 2007, Click on the \"Office\" icon in the top left-hand corner, and click on \"Excel Options\" to the bottom right."]
[null,"3) In the \"Excel Options\" window, click on the \"Trust Center,\" and then click on the \"Trust Center Settings.\""]
[]
[]
[]
[]
[]
[]
[]
[]
[]
[]
[]
[]
[]
[]
[]
[]
[]
[]
[]
[]
[]
[]
[]
[]
[]
[]
[]
[]
[null,"4) Under Message Bar, check to make sure that the \"Show the Message Bar in all applications when content has been blocked\" button is selected."]
[]
[]
[]
[]
[]
[]
[]
[]
[]
[]
[]
[]
[]
[]
[]
[]
[]
[]
[]
[]
[]
[null,"5) Under Macro Settings, select the option that says, \"Disable all macros with notification.\""]
[]
[]
[]
[]
[]
[]
[]
[]
[]
[]
[]
[]
[]
[]
[]
[]
[]
[]
[]
[]
[]
[null,"6) Select 'Ok' twice to close out the dialog boxes."]
[null,"7) Open the Mowing Calculator.  Select the option to Enable Content if a message bar asks if you wish to do so. "]

{"sheet":"Mowing Scenario","index":2,"n_rows":170,"n_cols":59,"rows_kept":170,"cut":false,"hidden":false,"merged":[[49,2,49,3],[50,2,50,3],[51,2,51,3],[151,2,151,5],[148,2,148,15],[120,13,120,15],[113,2,113,3],[114,2,114,3],[115,2,115,3],[116,2,116,3],[117,2,117,3],[143,3,143,6],[169,1,171,16],[120,49,120,51],[167,1,168,16],[163,2,163,5],[48,44,48,45],[49,44,49,45],[50,44,50,45],[51,44,51,45],[52,44,52,45],[113,44,113,45],[114,44,114,45],[115,44,115,45],[116,44,116,45],[117,44,117,45],[52,2,52,3],[48,2,48,3]]}
[]
[null,"Compare current and future practices"]
[]
[]
[]
[]
[null,"Summary Results"]
[null,null,null,"Mowed Area",null,null,null,"Mowing Hours",null,null,null,"Fuel Use",null,null,null,"Fuel Costs"]
[null,null,"Current Practices",{"$f":"IFERROR(Results!D8,0)","v":""},"acres",null,null,{"$f":"IFERROR(Results!D19,0)","v":0},"hours",null,null,{"$f":"IFERROR(Results!H8,0)","v":0},"GGE*",null,null,{"$f":"IFERROR(Results!J8,0)","v":0}]
[null,null,"Future Practices",{"$f":"IF(A69>0,IFERROR(Results!D9,0),0)","v":0},"acres",null,null,{"$f":"IF(A69>0,IFERROR(Results!D20,0),0)","v":0},"hours",null,null,{"$f":"IF(A69>0,IFERROR(Results!H9,0),0)","v":0},"GGE*",null,null,{"$f":"IF(A69>0,IFERROR(Results!J9,0),0)","v":0}]
[]
[null,null,"Savings",{"$f":"IF(A69>0,IFERROR(Results!D10,0),0)","v":0},"acres",null,null,{"$f":"IF(A69>0,IFERROR(Results!D21,0),0)","v":0},"hours",null,null,{"$f":"IF(A69>0,IFERROR(Results!H10,0),0)","v":0},"GGE*",null,null,{"$f":"IF(A69>0,IFERROR(Results!K64,0),0)","v":0}]
[]
[]
[]
[]
[]
[null,"Current Mowing Practices"]
[null,null,"You must enter the acres mowed in the yellow cell below.  All other inputs are optional.  Default data are provided where possible."]
[null,null,"General Information"]
[null,null,null,null,null,null,null,"How large is the area that you mow?",null,"","acres",null,null,null,null,null,null,null,null,null,null,null,null,null,null,null,null,null,null,null,null,null,null,null,null,null,null,null,null,null,null,null,null,null,null,null,null,null,null,null,null,{"$f":"IF(VLOOKUP($C$164,Scenarios!$A$3:$DZ$994,BA21,0)=\"\",\"\",VLOOKUP($C$164,Scenarios!$A$3:$DZ$994,BA21,0))","v":{"$error":"#N/A"}},{"$f":"COLUMN(Scenarios!B1)","v":2}]
[]
[null,null,null,null,null,null,null,"How frequently do you mow the lawn? Once every…",null,7,"days",null,null,null,null,null,null,null,null,null,null,null,null,null,null,null,null,null,null,null,null,null,null,null,null,null,null,null,null,null,null,null,null,null,null,null,null,null,null,null,null,{"$f":"IF(VLOOKUP($C$164,Scenarios!$A$3:$DZ$994,BA23,0)=\"\",\"\",VLOOKUP($C$164,Scenarios!$A$3:$DZ$994,BA23,0))","v":{"$error":"#N/A"}},{"$f":"COLUMN(Scenarios!C1)","v":3}]
[]
[null,null,null,null,null,null,null,"How many weeks long is the mowing season?",null,26,"weeks",null,null,null,null,null,null,null,null,null,null,null,null,null,null,null,null,null,null,null,null,null,null,null,null,null,null,null,null,null,null,null,null,null,null,null,null,null,null,null,null,{"$f":"IF(VLOOKUP($C$164,Scenarios!$A$3:$DZ$994,BA25,0)=\"\",\"\",VLOOKUP($C$164,Scenarios!$A$3:$DZ$994,BA25,0))","v":{"$error":"#N/A"}},{"$f":"COLUMN(Scenarios!D1)","v":4}]
[]
[null,null,null,null,null,null,null,"How many mowers do you have?",null,null,null,null,null,null,null,null,null,null,null,null,null,null,null,null,null,null,null,null,null,null,null,null,null,null,null,null,null,null,null,null,null,null,null,null,null,null,null,null,null,null,null,{"$f":"VLOOKUP($C$164,Scenarios!$A$3:$DZ$994,BA27,0)","v":{"$error":"#N/A"}},{"$f":"COLUMN(Scenarios!E1)","v":5}]
[]
[]
[true]
[]
[null,null,"Single Mower Information"]
[]
[null,null,null,null,null,null,null,"How large is the mower's deck?",null,46,"inches",null,null,null,null,null,null,null,null,null,null,null,null,null,null,null,null,null,null,null,null,null,null,null,null,null,null,null,null,null,null,null,null,null,null,null,null,null,null,null,null,{"$f":"IF(VLOOKUP($C$164,Scenarios!$A$3:$DZ$994,BA34,0)=\"\",\"\",VLOOKUP($C$164,Scenarios!$A$3:$DZ$994,BA34,0))","v":{"$error":"#N/A"}},{"$f":"COLUMN(Scenarios!F1)","v":6}]
[]
[null,null,null,null,null,null,null,"What's the mower's horsepower (hp)?",null,20,"hp",null,null,null,null,null,null,null,null,null,null,null,null,null,null,null,null,null,null,null,null,null,null,null,null,null,null,null,null,null,null,null,null,null,null,null,null,null,null,null,null,{"$f":"IF(VLOOKUP($C$164,Scenarios!$A$3:$DZ$994,BA36,0)=\"\",\"\",VLOOKUP($C$164,Scenarios!$A$3:$DZ$994,BA36,0))","v":{"$error":"#N/A"}},{"$f":"COLUMN(Scenarios!G1)","v":7}]
[]
[null,null,null,null,null,null,null,"What type of fuel does the mower use?",null,"Gasoline",null,null,null,null,null,null,null,null,null,null,null,null,null,null,null,null,null,null,null,null,null,null,null,null,null,null,null,null,null,null,null,null,null,null,null,null,null,null,null,null,null,{"$f":"IF(VLOOKUP($C$164,Scenarios!$A$3:$DZ$994,BA38,0)=\"\",\"\",VLOOKUP($C$164,Scenarios!$A$3:$DZ$994,BA38,0))","v":{"$error":"#N/A"}},{"$f":"COLUMN(Scenarios!H1)","v":8}]
[]
[null,null,null,null,null,null,null,"What's the average fuel cost?",null,3.7,"$/gallon",null,null,null,null,null,null,null,null,null,null,null,null,null,null,null,null,null,null,null,null,null,null,null,null,null,null,null,null,null,null,null,null,null,null,null,null,null,null,null,null,{"$f":"IF(VLOOKUP($C$164,Scenarios!$A$3:$DZ$994,BA40,0)=\"\",\"\",VLOOKUP($C$164,Scenarios!$A$3:$DZ$994,BA40,0))","v":{"$error":"#N/A"}},{"$f":"COLUMN(Scenarios!I1)","v":9}]
[null,null,null,null,null,null,null,null,"Don't know?  Here's the average.",{"$f":"IFERROR(VLOOKUP(J38,Factors!$B$45:$C$47,2,0),0)","v":3.7},"$/gallon"]
[]
[null,null,null,null,null,null,null,"How fast do you go when you're mowing the lawn?",null,5,"mph",null,null,null,null,null,null,null,null,null,null,null,null,null,null,null,null,null,null,null,null,null,null,null,null,null,null,null,null,null,null,null,null,null,null,null,null,null,null,null,null,{"$f":"IF(VLOOKUP($C$164,Scenarios!$A$3:$DZ$994,BA43,0)=\"\",\"\",VLOOKUP($C$164,Scenarios!$A$3:$DZ$994,BA43,0))","v":{"$error":"#N/A"}},{"$f":"COLUMN(Scenarios!J$1)","v":10}]
[]
[]
[null,null,"Multiple Mower Information"]
[null,null,"Complete the table below for up to 5 mowers.  Leave additional rows blank if you have fewer than 5 mowers."]
[null,null,"Name",null,null,"Deck Size (in)",null,"Horsepower (hp)",null,"Fuel Type",null,"Fuel cost ($/gallon)",null,"Mow speed (mph)",null,"% of total acres"]
[null,null,"","",null,46,null,20,null,"Gasoline",null,3.7,null,5,null,100,null,null,null,null,null,null,null,null,null,null,null,null,null,null,null,null,null,null,null,null,null,null,null,null,null,null,null,null,{"$f":"IF(VLOOKUP($C$164,Scenarios!$A$3:$DZ$994,BA49,0)=\"\",\"\",VLOOKUP($C$164,Scenarios!$A$3:$DZ$994,BA49,0))","v":{"$error":"#N/A"}},null,{"$f":"IF(VLOOKUP($C$164,Scenarios!$A$3:$DZ$994,BB49,0)=\"\",\"\",VLOOKUP($C$164,Scenarios!$A$3:$DZ$994,BB49,0))","v":{"$error":"#N/A"}},{"$f":"IF(VLOOKUP($C$164,Scenarios!$A$3:$DZ$994,BC49,0)=\"\",\"\",VLOOKUP($C$164,Scenarios!$A$3:$DZ$994,BC49,0))","v":{"$error":"#N/A"}},{"$f":"IF(VLOOKUP($C$164,Scenarios!$A$3:$DZ$994,BD49,0)=\"\",\"\",VLOOKUP($C$164,Scenarios!$A$3:$DZ$994,BD49,0))","v":{"$error":"#N/A"}},{"$f":"IF(VLOOKUP($C$164,Scenarios!$A$3:$DZ$994,BE49,0)=\"\",\"\",VLOOKUP($C$164,Scenarios!$A$3:$DZ$994,BE49,0))","v":{"$error":"#N/A"}},{"$f":"IF(VLOOKUP($C$164,Scenarios!$A$3:$DZ$994,BF49,0)=\"\",\"\",VLOOKUP($C$164,Scenarios!$A$3:$DZ$994,BF49,0))","v":{"$error":"#N/A"}},{"$f":"IF(VLOOKUP($C$164,Scenarios!$A$3:$DZ$994,BG49,0)=\"\",\"\",VLOOKUP($C$164,Scenarios!$A$3:$DZ$994,BG49,0))","v":{"$error":"#N/A"}},{"$f":"COLUMN(Scenarios!K$1)","v":11},{"$f":"COLUMN(Scenarios!L$1)","v":12},{"$f":"COLUMN(Scenarios!M$1)","v":13},{"$f":"COLUMN(Scenarios!N$1)","v":14},{"$f":"COLUMN(Scenarios!O$1)","v":15},{"$f":"COLUMN(Scenarios!P$1)","v":16},{"$f":"COLUMN(Scenarios!Q$1)","v":17}]
[null,null,"","",null,"",null,"",null,"",null,"",null,"",null,"",null,null,null,null,null,null,null,null,null,null,null,null,null,null,null,null,null,null,null,null,null,null,null,null,null,null,null,null,{"$f":"IF(VLOOKUP($C$164,Scenarios!$A$3:$DZ$994,BA50,0)=\"\",\"\",VLOOKUP($C$164,Scenarios!$A$3:$DZ$994,BA50,0))","v":{"$error":"#N/A"}},null,{"$f":"IF(VLOOKUP($C$164,Scenarios!$A$3:$DZ$994,BB50,0)=\"\",\"\",VLOOKUP($C$164,Scenarios!$A$3:$DZ$994,BB50,0))","v":{"$error":"#N/A"}},{"$f":"IF(VLOOKUP($C$164,Scenarios!$A$3:$DZ$994,BC50,0)=\"\",\"\",VLOOKUP($C$164,Scenarios!$A$3:$DZ$994,BC50,0))","v":{"$error":"#N/A"}},{"$f":"IF(VLOOKUP($C$164,Scenarios!$A$3:$DZ$994,BD50,0)=\"\",\"\",VLOOKUP($C$164,Scenarios!$A$3:$DZ$994,BD50,0))","v":{"$error":"#N/A"}},{"$f":"IF(VLOOKUP($C$164,Scenarios!$A$3:$DZ$994,BE50,0)=\"\",\"\",VLOOKUP($C$164,Scenarios!$A$3:$DZ$994,BE50,0))","v":{"$error":"#N/A"}},{"$f":"IF(VLOOKUP($C$164,Scenarios!$A$3:$DZ$994,BF50,0)=\"\",\"\",VLOOKUP($C$164,Scenarios!$A$3:$DZ$994,BF50,0))","v":{"$error":"#N/A"}},{"$f":"IF(VLOOKUP($C$164,Scenarios!$A$3:$DZ$994,BG50,0)=\"\",\"\",VLOOKUP($C$164,Scenarios!$A$3:$DZ$994,BG50,0))","v":{"$error":"#N/A"}},{"$f":"COLUMN(Scenarios!R$1)","v":18},{"$f":"COLUMN(Scenarios!S$1)","v":19},{"$f":"COLUMN(Scenarios!T$1)","v":20},{"$f":"COLUMN(Scenarios!U$1)","v":21},{"$f":"COLUMN(Scenarios!V$1)","v":22},{"$f":"COLUMN(Scenarios!W$1)","v":23},{"$f":"COLUMN(Scenarios!X$1)","v":24}]
[null,null,"","",null,"",null,"",null,"",null,"",null,"",null,"",null,null,null,null,null,null,null,null,null,null,null,null,null,null,null,null,null,null,null,null,null,null,null,null,null,null,null,null,{"$f":"IF(VLOOKUP($C$164,Scenarios!$A$3:$DZ$994,BA51,0)=\"\",\"\",VLOOKUP($C$164,Scenarios!$A$3:$DZ$994,BA51,0))","v":{"$error":"#N/A"}},null,{"$f":"IF(VLOOKUP($C$164,Scenarios!$A$3:$DZ$994,BB51,0)=\"\",\"\",VLOOKUP($C$164,Scenarios!$A$3:$DZ$994,BB51,0))","v":{"$error":"#N/A"}},{"$f":"IF(VLOOKUP($C$164,Scenarios!$A$3:$DZ$994,BC51,0)=\"\",\"\",VLOOKUP($C$164,Scenarios!$A$3:$DZ$994,BC51,0))","v":{"$error":"#N/A"}},{"$f":"IF(VLOOKUP($C$164,Scenarios!$A$3:$DZ$994,BD51,0)=\"\",\"\",VLOOKUP($C$164,Scenarios!$A$3:$DZ$994,BD51,0))","v":{"$error":"#N/A"}},{"$f":"IF(VLOOKUP($C$164,Scenarios!$A$3:$DZ$994,BE51,0)=\"\",\"\",VLOOKUP($C$164,Scenarios!$A$3:$DZ$994,BE51,0))","v":{"$error":"#N/A"}},{"$f":"IF(VLOOKUP($C$164,Scenarios!$A$3:$DZ$994,BF51,0)=\"\",\"\",VLOOKUP($C$164,Scenarios!$A$3:$DZ$994,BF51,0))","v":{"$error":"#N/A"}},{"$f":"IF(VLOOKUP($C$164,Scenarios!$A$3:$DZ$994,BG51,0)=\"\",\"\",VLOOKUP($C$164,Scenarios!$A$3:$DZ$994,BG51,0))","v":{"$error":"#N/A"}},{"$f":"COLUMN(Scenarios!Y$1)","v":25},{"$f":"COLUMN(Scenarios!Z$1)","v":26},{"$f":"COLUMN(Scenarios!AA$1)","v":27},{"$f":"COLUMN(Scenarios!AB$1)","v":28},{"$f":"COLUMN(Scenarios!AC$1)","v":29},{"$f":"COLUMN(Scenarios!AD$1)","v":30},{"$f":"COLUMN(Scenarios!AE$1)","v":31}]
[null,null,"","",null,"",null,"",null,"",null,"",null,"",null,"",null,null,null,null,null,null,null,null,null,null,null,null,null,null,null,null,null,null,null,null,null,null,null,null,null,null,null,null,{"$f":"IF(VLOOKUP($C$164,Scenarios!$A$3:$DZ$994,BA52,0)=\"\",\"\",VLOOKUP($C$164,Scenarios!$A$3:$DZ$994,BA52,0))","v":{"$error":"#N/A"}},null,{"$f":"IF(VLOOKUP($C$164,Scenarios!$A$3:$DZ$994,BB52,0)=\"\",\"\",VLOOKUP($C$164,Scenarios!$A$3:$DZ$994,BB52,0))","v":{"$error":"#N/A"}},{"$f":"IF(VLOOKUP($C$164,Scenarios!$A$3:$DZ$994,BC52,0)=\"\",\"\",VLOOKUP($C$164,Scenarios!$A$3:$DZ$994,BC52,0))","v":{"$error":"#N/A"}},{"$f":"IF(VLOOKUP($C$164,Scenarios!$A$3:$DZ$994,BD52,0)=\"\",\"\",VLOOKUP($C$164,Scenarios!$A$3:$DZ$994,BD52,0))","v":{"$error":"#N/A"}},{"$f":"IF(VLOOKUP($C$164,Scenarios!$A$3:$DZ$994,BE52,0)=\"\",\"\",VLOOKUP($C$164,Scenarios!$A$3:$DZ$994,BE52,0))","v":{"$error":"#N/A"}},{"$f":"IF(VLOOKUP($C$164,Scenarios!$A$3:$DZ$994,BF52,0)=\"\",\"\",VLOOKUP($C$164,Scenarios!$A$3:$DZ$994,BF52,0))","v":{"$error":"#N/A"}},{"$f":"IF(VLOOKUP($C$164,Scenarios!$A$3:$DZ$994,BG52,0)=\"\",\"\",VLOOKUP($C$164,Scenarios!$A$3:$DZ$994,BG52,0))","v":{"$error":"#N/A"}},{"$f":"COLUMN(Scenarios!AF$1)","v":32},{"$f":"COLUMN(Scenarios!AG$1)","v":33},{"$f":"COLUMN(Scenarios!AH$1)","v":34},{"$f":"COLUMN(Scenarios!AI$1)","v":35},{"$f":"COLUMN(Scenarios!AJ$1)","v":36},{"$f":"COLUMN(Scenarios!AK$1)","v":37},{"$f":"COLUMN(Scenarios!AL$1)","v":38}]
[null,null,"","",null,"",null,"",null,"",null,"",null,"",null,"",null,null,null,null,null,null,null,null,null,null,null,null,null,null,null,null,null,null,null,null,null,null,null,null,null,null,null,null,{"$f":"IF(VLOOKUP($C$164,Scenarios!$A$3:$DZ$994,BA53,0)=\"\",\"\",VLOOKUP($C$164,Scenarios!$A$3:$DZ$994,BA53,0))","v":{"$error":"#N/A"}},null,{"$f":"IF(VLOOKUP($C$164,Scenarios!$A$3:$DZ$994,BB53,0)=\"\",\"\",VLOOKUP($C$164,Scenarios!$A$3:$DZ$994,BB53,0))","v":{"$error":"#N/A"}},{"$f":"IF(VLOOKUP($C$164,Scenarios!$A$3:$DZ$994,BC53,0)=\"\",\"\",VLOOKUP($C$164,Scenarios!$A$3:$DZ$994,BC53,0))","v":{"$error":"#N/A"}},{"$f":"IF(VLOOKUP($C$164,Scenarios!$A$3:$DZ$994,BD53,0)=\"\",\"\",VLOOKUP($C$164,Scenarios!$A$3:$DZ$994,BD53,0))","v":{"$error":"#N/A"}},{"$f":"IF(VLOOKUP($C$164,Scenarios!$A$3:$DZ$994,BE53,0)=\"\",\"\",VLOOKUP($C$164,Scenarios!$A$3:$DZ$994,BE53,0))","v":{"$error":"#N/A"}},{"$f":"IF(VLOOKUP($C$164,Scenarios!$A$3:$DZ$994,BF53,0)=\"\",\"\",VLOOKUP($C$164,Scenarios!$A$3:$DZ$994,BF53,0))","v":{"$error":"#N/A"}},{"$f":"IF(VLOOKUP($C$164,Scenarios!$A$3:$DZ$994,BG53,0)=\"\",\"\",VLOOKUP($C$164,Scenarios!$A$3:$DZ$994,BG53,0))","v":{"$error":"#N/A"}},{"$f":"COLUMN(Scenarios!AM$1)","v":39},{"$f":"COLUMN(Scenarios!AN$1)","v":40},{"$f":"COLUMN(Scenarios!AO$1)","v":41},{"$f":"COLUMN(Scenarios!AP$1)","v":42},{"$f":"COLUMN(Scenarios!AQ$1)","v":43},{"$f":"COLUMN(Scenarios!AR$1)","v":44},{"$f":"COLUMN(Scenarios!AS$1)","v":45}]
[null,null,null,null,null,null,null,null,null,null,null,null,null,null,null,{"$f":"SUM(Table1g)/100","v":1}]
[]
[null,null,"Irrigation Information (Optional)"]
[]
[null,null,null,null,null,null,null,"What percent of the lawn is irrigated routinely?",null,"","%",{"$f":"IFERROR(J21*J58/100,\"\")","v":""},"acres",null,null,null,null,null,null,null,null,null,null,null,null,null,null,null,null,null,null,null,null,null,null,null,null,null,null,null,null,null,null,null,null,null,null,null,null,null,null,{"$f":"IF(VLOOKUP($C$164,Scenarios!$A$3:$DZ$994,BA58,0)=\"\",\"\",VLOOKUP($C$164,Scenarios!$A$3:$DZ$994,BA58,0))","v":{"$error":"#N/A"}},{"$f":"COLUMN(Scenarios!AT1)","v":46}]
[null,null,null,null,null,null,null,"If none, leave blank."]
[]
[null,null,null,null,null,null,null,"How often do you irrigate?",null,"","times per season",null,null,null,null,null,null,null,null,null,null,null,null,null,null,null,null,null,null,null,null,null,null,null,null,null,null,null,null,null,null,null,null,null,null,null,null,null,null,null,null,{"$f":"IF(VLOOKUP($C$164,Scenarios!$A$3:$DZ$994,BA61,0)=\"\",\"\",VLOOKUP($C$164,Scenarios!$A$3:$DZ$994,BA61,0))","v":{"$error":"#N/A"}},{"$f":"COLUMN(Scenarios!AU1)","v":47}]
[null,null,null,null,null,null,null," Learn more"]
[]
[null,null,null,null,null,null,null,"How much water do you use?",null,1,"inch(es) per irrigation cycle",null,null,null,null,null,null,null,null,null,null,null,null,null,null,null,null,null,null,null,null,null,null,null,null,null,null,null,null,null,null,null,null,null,null,null,null,null,null,null,null,{"$f":"IF(VLOOKUP($C$164,Scenarios!$A$3:$DZ$994,BA64,0)=\"\",\"\",VLOOKUP($C$164,Scenarios!$A$3:$DZ$994,BA64,0))","v":{"$error":"#N/A"}},{"$f":"COLUMN(Scenarios!AV1)","v":48}]
[null,null,null,null,null,null,null,null,"Don't know?  Here's the average.",1,"inch per irrigation cycle"]
[]
[]
[]
[{"$f":"SUM(IF(CheckMowArea=TRUE,1,0),IF(CheckMowLess=TRUE,1,0),IF(CheckMower=TRUE,1,0),IF(CheckIrrigate=TRUE,1,0))","v":0},"Future Mowing Practices"]
[null,null,"Save time, money and reduce the environmental impact by…"]
[false,null,"Mowing less area.",null,null,null,null,null,null,null,null,null,null,null,null,null,null,null,null,null,null,null,null,null,null,null,null,null,null,null,null,null,null,null,null,null,null,null,null,null,null,null,null,null,null,null,null,null,null,null,null,{"$f":"VLOOKUP($C$164,Scenarios!$A$3:$DZ$994,BA71,0)","v":{"$error":"#N/A"}},{"$f":"COLUMN(Scenarios!AW1)","v":49}]
[]
[null,null,{"$f":"\"You currently mow about \"&J21&\" acres.\"","v":"You currently mow about  acres."},null,null,null,null,null,null,null,null,"Acres","or","% of Total"]
[]
[null,null,"How much would you like to reduce this amount? Enter in acres or as a percent of total.",null,null,null,null,null,null,null,null,0,null,0,null,null,null,null,null,null,null,null,null,null,null,null,null,null,null,null,null,null,null,null,null,null,null,null,null,null,null,null,null,null,null,null,null,null,null,null,{"$f":"VLOOKUP($C$164,Scenarios!$A$3:$DZ$994,BA75,0)","v":{"$error":"#N/A"}},{"$f":"VLOOKUP($C$164,Scenarios!$A$3:$DZ$994,BB75,0)","v":{"$error":"#N/A"}},{"$f":"COLUMN(Scenarios!AX1)","v":50},{"$f":"COLUMN(Scenarios!AY1)","v":51}]
[null,null,null,null,null,null,null,null,null,null,null,{"$f":"IFERROR(N75/100*J21,0)","v":0},null,{"$f":"IFERROR(L75/J21,0)","v":0}]
[]
[null,null,null,null,"New mow area:",{"$f":"IFERROR(J21-IF(L75>0,L75,L76),0)","v":0},"acres"]
[]
[null,null,"Do you still plan to mow the \"unmowed\" area a few times each season?  If so, how many?",null,null,null,null,null,null,null,null,"","times per season",null,null,null,null,null,null,null,null,null,null,null,null,null,null,null,null,null,null,null,null,null,null,null,null,null,null,null,null,null,null,null,null,null,null,null,null,null,null,{"$f":"IF(VLOOKUP($C$164,Scenarios!$A$3:$DZ$994,BA80,0)=\"\",\"\",VLOOKUP($C$164,Scenarios!$A$3:$DZ$994,BA80,0))","v":{"$error":"#N/A"}},{"$f":"COLUMN(Scenarios!AZ1)","v":52}]
[]
[]
[false,null,"Mowing less often.",null,null,null,null,null,null,null,null,null,null,null,null,null,null,null,null,null,null,null,null,null,null,null,null,null,null,null,null,null,null,null,null,null,null,null,null,null,null,null,null,null,null,null,null,null,null,null,null,{"$f":"VLOOKUP($C$164,Scenarios!$A$3:$DZ$994,BA83,0)","v":{"$error":"#N/A"}},{"$f":"COLUMN(Scenarios!BA1)","v":53}]
[]
[null,null,{"$f":"IFERROR(\"You currently mow the lawn once every \"&J23&\" days during a season that lasts \"&J25&\" weeks.  This means you mow the lawn about \"&(J25*7/J23)&\" times each season.\",\"\")","v":"You currently mow the lawn once every 7 days during a season that lasts 26 weeks.  This means you mow the lawn about 26 times each season."}]
[]
[null,null,"Enter a new frequency for mowing the lawn. ",null,null,null,null,null,null,null,"Once every…","","days",null,null,null,null,null,null,null,null,null,null,null,null,null,null,null,null,null,null,null,null,null,null,null,null,null,null,null,null,null,null,null,null,null,null,null,null,null,null,{"$f":"IF(VLOOKUP($C$164,Scenarios!$A$3:$DZ$994,BA87,0)=\"\",\"\",VLOOKUP($C$164,Scenarios!$A$3:$DZ$994,BA87,0))","v":{"$error":"#N/A"}},{"$f":"COLUMN(Scenarios!BB1)","v":54}]
[]
[null,null,null,null,null,null,null,null,null,null,"During a season that lasts…","","weeks",null,null,null,null,null,null,null,null,null,null,null,null,null,null,null,null,null,null,null,null,null,null,null,null,null,null,null,null,null,null,null,null,null,null,null,null,null,null,{"$f":"IF(VLOOKUP($C$164,Scenarios!$A$3:$DZ$994,BA89,0)=\"\",\"\",VLOOKUP($C$164,Scenarios!$A$3:$DZ$994,BA89,0))","v":{"$error":"#N/A"}},{"$f":"COLUMN(Scenarios!BC1)","v":55}]
[]
[null,null,null,null,"New mow frequency:",{"$f":"IFERROR(IF(L87>0,IF(L89>0,L89*7/L87,J25*7/J23),J25*7/J23),0)","v":0},"times per season"]
[]
[]
[]
[false,null,"Changing the type of mower used.",null,null,null,null,null,null,null,null,null,null,null,null,null,null,null,null,null,null,null,null,null,null,null,null,null,null,null,null,null,null,null,null,null,null,null,null,null,null,null,null,null,null,null,null,null,null,null,null,{"$f":"VLOOKUP($C$164,Scenarios!$A$3:$DZ$994,BA95,0)","v":{"$error":"#N/A"}},{"$f":"COLUMN(Scenarios!BD1)","v":56}]
[]
[null,null,{"$f":"\"You currently use a \"&J36&\" horsepower \"&J38&\" lawn mower with a \"&J34&\" inch deck and an average speed of about \"&J43&\" miles per hour.\"","v":"You currently use a 20 horsepower Gasoline lawn mower with a 46 inch deck and an average speed of about 5 miles per hour."}]
[]
[null,null,"Choose the specifications for the new mower.",null,null,null,null,null,null,null,"Deck Size:","","inches",null,null,null,null,null,null,null,null,null,null,null,null,null,null,null,null,null,null,null,null,null,null,null,null,null,null,null,null,null,null,null,null,null,null,null,null,null,null,{"$f":"IF(VLOOKUP($C$164,Scenarios!$A$3:$DZ$994,BA99,0)=\"\",\"\",VLOOKUP($C$164,Scenarios!$A$3:$DZ$994,BA99,0))","v":{"$error":"#N/A"}},{"$f":"COLUMN(Scenarios!BE1)","v":57}]
[]
[null,null,null,null,null,null,null,null,null,null,"Horsepower:","","hp",null,null,null,null,null,null,null,null,null,null,null,null,null,null,null,null,null,null,null,null,null,null,null,null,null,null,null,null,null,null,null,null,null,null,null,null,null,null,{"$f":"IF(VLOOKUP($C$164,Scenarios!$A$3:$DZ$994,BA101,0)=\"\",\"\",VLOOKUP($C$164,Scenarios!$A$3:$DZ$994,BA101,0))","v":{"$error":"#N/A"}},{"$f":"COLUMN(Scenarios!BF1)","v":58}]
[]
[null,null,null,null,null,null,null,null,null,null,"Fuel Type:","Gasoline",null,null,null,null,null,null,null,null,null,null,null,null,null,null,null,null,null,null,null,null,null,null,null,null,null,null,null,null,null,null,null,null,null,null,null,null,null,null,null,{"$f":"IF(VLOOKUP($C$164,Scenarios!$A$3:$DZ$994,BA103,0)=\"\",\"\",VLOOKUP($C$164,Scenarios!$A$3:$DZ$994,BA103,0))","v":{"$error":"#N/A"}},{"$f":"COLUMN(Scenarios!BG1)","v":59}]
[]
[null,null,null,null,null,null,null,null,null,"What's the average fuel cost?",null,"","$/gallon",null,null,null,null,null,null,null,null,null,null,null,null,null,null,null,null,null,null,null,null,null,null,null,null,null,null,null,null,null,null,null,null,null,null,null,null,null,null,{"$f":"IF(VLOOKUP($C$164,Scenarios!$A$3:$DZ$994,BA105,0)=\"\",\"\",VLOOKUP($C$164,Scenarios!$A$3:$DZ$994,BA105,0))","v":{"$error":"#N/A"}},{"$f":"COLUMN(Scenarios!BH1)","v":60}]
[null,null,null,null,null,null,null,null,null,null,"Don't know?  Here's the average.",{"$f":"VLOOKUP(L103,Factors!$B$45:$C$47,2,0)","v":3.7},"$/gallon"]
[]
[null,null,null,null,null,null,null,null,null,null,"Mow Speed:","","mph",null,null,null,null,null,null,null,null,null,null,null,null,null,null,null,null,null,null,null,null,null,null,null,null,null,null,null,null,null,null,null,null,null,null,null,null,null,null,{"$f":"IF(VLOOKUP($C$164,Scenarios!$A$3:$DZ$994,BA108,0)=\"\",\"\",VLOOKUP($C$164,Scenarios!$A$3:$DZ$994,BA108,0))","v":{"$error":"#N/A"}},{"$f":"COLUMN(Scenarios!BI1)","v":61}]
[]
[]
[null,null,"Please enter the parameters for the new mowers in the cells below."]
[]
[null,null,"Name",null,null,"Deck Size (in)",null,"Horsepower (hp)",null,"Fuel Type",null,"Fuel cost ($/gallon)",null,"Mow speed (mph)",null,"% of total acres"]
[null,null,"","",null,"",null,"",null,"",null,"",null,"",null,"",null,null,null,null,null,null,null,null,null,null,null,null,null,null,null,null,null,null,null,null,null,null,null,null,null,null,null,null,{"$f":"IF(VLOOKUP($C$164,Scenarios!$A$3:$DZ$994,BA114,0)=\"\",\"\",VLOOKUP($C$164,Scenarios!$A$3:$DZ$994,BA114,0))","v":{"$error":"#N/A"}},null,{"$f":"IF(VLOOKUP($C$164,Scenarios!$A$3:$DZ$994,BB114,0)=\"\",\"\",VLOOKUP($C$164,Scenarios!$A$3:$DZ$994,BB114,0))","v":{"$error":"#N/A"}},{"$f":"IF(VLOOKUP($C$164,Scenarios!$A$3:$DZ$994,BC114,0)=\"\",\"\",VLOOKUP($C$164,Scenarios!$A$3:$DZ$994,BC114,0))","v":{"$error":"#N/A"}},{"$f":"IF(VLOOKUP($C$164,Scenarios!$A$3:$DZ$994,BD114,0)=\"\",\"\",VLOOKUP($C$164,Scenarios!$A$3:$DZ$994,BD114,0))","v":{"$error":"#N/A"}},{"$f":"IF(VLOOKUP($C$164,Scenarios!$A$3:$DZ$994,BE114,0)=\"\",\"\",VLOOKUP($C$164,Scenarios!$A$3:$DZ$994,BE114,0))","v":{"$error":"#N/A"}},{"$f":"IF(VLOOKUP($C$164,Scenarios!$A$3:$DZ$994,BF114,0)=\"\",\"\",VLOOKUP($C$164,Scenarios!$A$3:$DZ$994,BF114,0))","v":{"$error":"#N/A"}},{"$f":"IF(VLOOKUP($C$164,Scenarios!$A$3:$DZ$994,BG114,0)=\"\",\"\",VLOOKUP($C$164,Scenarios!$A$3:$DZ$994,BG114,0))","v":{"$error":"#N/A"}},{"$f":"COLUMN(Scenarios!BJ$1)","v":62},{"$f":"COLUMN(Scenarios!BK$1)","v":63},{"$f":"COLUMN(Scenarios!BL$1)","v":64},{"$f":"COLUMN(Scenarios!BM$1)","v":65},{"$f":"COLUMN(Scenarios!BN$1)","v":66},{"$f":"COLUMN(Scenarios!BO$1)","v":67},{"$f":"COLUMN(Scenarios!BP$1)","v":68}]
[null,null,"","",null,"",null,"",null,"",null,"",null,"",null,"",null,null,null,null,null,null,null,null,null,null,null,null,null,null,null,null,null,null,null,null,null,null,null,null,null,null,null,null,{"$f":"IF(VLOOKUP($C$164,Scenarios!$A$3:$DZ$994,BA115,0)=\"\",\"\",VLOOKUP($C$164,Scenarios!$A$3:$DZ$994,BA115,0))","v":{"$error":"#N/A"}},null,{"$f":"IF(VLOOKUP($C$164,Scenarios!$A$3:$DZ$994,BB115,0)=\"\",\"\",VLOOKUP($C$164,Scenarios!$A$3:$DZ$994,BB115,0))","v":{"$error":"#N/A"}},{"$f":"IF(VLOOKUP($C$164,Scenarios!$A$3:$DZ$994,BC115,0)=\"\",\"\",VLOOKUP($C$164,Scenarios!$A$3:$DZ$994,BC115,0))","v":{"$error":"#N/A"}},{"$f":"IF(VLOOKUP($C$164,Scenarios!$A$3:$DZ$994,BD115,0)=\"\",\"\",VLOOKUP($C$164,Scenarios!$A$3:$DZ$994,BD115,0))","v":{"$error":"#N/A"}},{"$f":"IF(VLOOKUP($C$164,Scenarios!$A$3:$DZ$994,BE115,0)=\"\",\"\",VLOOKUP($C$164,Scenarios!$A$3:$DZ$994,BE115,0))","v":{"$error":"#N/A"}},{"$f":"IF(VLOOKUP($C$164,Scenarios!$A$3:$DZ$994,BF115,0)=\"\",\"\",VLOOKUP($C$164,Scenarios!$A$3:$DZ$994,BF115,0))","v":{"$error":"#N/A"}},{"$f":"IF(VLOOKUP($C$164,Scenarios!$A$3:$DZ$994,BG115,0)=\"\",\"\",VLOOKUP($C$164,Scenarios!$A$3:$DZ$994,BG115,0))","v":{"$error":"#N/A"}},{"$f":"COLUMN(Scenarios!BQ$1)","v":69},{"$f":"COLUMN(Scenarios!BR$1)","v":70},{"$f":"COLUMN(Scenarios!BS$1)","v":71},{"$f":"COLUMN(Scenarios!BT$1)","v":72},{"$f":"COLUMN(Scenarios!BU$1)","v":73},{"$f":"COLUMN(Scenarios!BV$1)","v":74},{"$f":"COLUMN(Scenarios!BW$1)","v":75}]
[null,null,"","",null,"",null,"",null,"",null,"",null,"",null,"",null,null,null,null,null,null,null,null,null,null,null,null,null,null,null,null,null,null,null,null,null,null,null,null,null,null,null,null,{"$f":"IF(VLOOKUP($C$164,Scenarios!$A$3:$DZ$994,BA116,0)=\"\",\"\",VLOOKUP($C$164,Scenarios!$A$3:$DZ$994,BA116,0))","v":{"$error":"#N/A"}},null,{"$f":"IF(VLOOKUP($C$164,Scenarios!$A$3:$DZ$994,BB116,0)=\"\",\"\",VLOOKUP($C$164,Scenarios!$A$3:$DZ$994,BB116,0))","v":{"$error":"#N/A"}},{"$f":"IF(VLOOKUP($C$164,Scenarios!$A$3:$DZ$994,BC116,0)=\"\",\"\",VLOOKUP($C$164,Scenarios!$A$3:$DZ$994,BC116,0))","v":{"$error":"#N/A"}},{"$f":"IF(VLOOKUP($C$164,Scenarios!$A$3:$DZ$994,BD116,0)=\"\",\"\",VLOOKUP($C$164,Scenarios!$A$3:$DZ$994,BD116,0))","v":{"$error":"#N/A"}},{"$f":"IF(VLOOKUP($C$164,Scenarios!$A$3:$DZ$994,BE116,0)=\"\",\"\",VLOOKUP($C$164,Scenarios!$A$3:$DZ$994,BE116,0))","v":{"$error":"#N/A"}},{"$f":"IF(VLOOKUP($C$164,Scenarios!$A$3:$DZ$994,BF116,0)=\"\",\"\",VLOOKUP($C$164,Scenarios!$A$3:$DZ$994,BF116,0))","v":{"$error":"#N/A"}},{"$f":"IF(VLOOKUP($C$164,Scenarios!$A$3:$DZ$994,BG116,0)=\"\",\"\",VLOOKUP($C$164,Scenarios!$A$3:$DZ$994,BG116,0))","v":{"$error":"#N/A"}},{"$f":"COLUMN(Scenarios!BX$1)","v":76},{"$f":"COLUMN(Scenarios!BY$1)","v":77},{"$f":"COLUMN(Scenarios!BZ$1)","v":78},{"$f":"COLUMN(Scenarios!CA$1)","v":79},{"$f":"COLUMN(Scenarios!CB$1)","v":80},{"$f":"COLUMN(Scenarios!CC$1)","v":81},{"$f":"COLUMN(Scenarios!CD$1)","v":82}]
[null,null,"","",null,"",null,"",null,"",null,"",null,"",null,"",null,null,null,null,null,null,null,null,null,null,null,null,null,null,null,null,null,null,null,null,null,null,null,null,null,null,null,null,{"$f":"IF(VLOOKUP($C$164,Scenarios!$A$3:$DZ$994,BA117,0)=\"\",\"\",VLOOKUP($C$164,Scenarios!$A$3:$DZ$994,BA117,0))","v":{"$error":"#N/A"}},null,{"$f":"IF(VLOOKUP($C$164,Scenarios!$A$3:$DZ$994,BB117,0)=\"\",\"\",VLOOKUP($C$164,Scenarios!$A$3:$DZ$994,BB117,0))","v":{"$error":"#N/A"}},{"$f":"IF(VLOOKUP($C$164,Scenarios!$A$3:$DZ$994,BC117,0)=\"\",\"\",VLOOKUP($C$164,Scenarios!$A$3:$DZ$994,BC117,0))","v":{"$error":"#N/A"}},{"$f":"IF(VLOOKUP($C$164,Scenarios!$A$3:$DZ$994,BD117,0)=\"\",\"\",VLOOKUP($C$164,Scenarios!$A$3:$DZ$994,BD117,0))","v":{"$error":"#N/A"}},{"$f":"IF(VLOOKUP($C$164,Scenarios!$A$3:$DZ$994,BE117,0)=\"\",\"\",VLOOKUP($C$164,Scenarios!$A$3:$DZ$994,BE117,0))","v":{"$error":"#N/A"}},{"$f":"IF(VLOOKUP($C$164,Scenarios!$A$3:$DZ$994,BF117,0)=\"\",\"\",VLOOKUP($C$164,Scenarios!$A$3:$DZ$994,BF117,0))","v":{"$error":"#N/A"}},{"$f":"IF(VLOOKUP($C$164,Scenarios!$A$3:$DZ$994,BG117,0)=\"\",\"\",VLOOKUP($C$164,Scenarios!$A$3:$DZ$994,BG117,0))","v":{"$error":"#N/A"}},{"$f":"COLUMN(Scenarios!CE$1)","v":83},{"$f":"COLUMN(Scenarios!CF$1)","v":84},{"$f":"COLUMN(Scenarios!CG$1)","v":85},{"$f":"COLUMN(Scenarios!CH$1)","v":86},{"$f":"COLUMN(Scenarios!CI$1)","v":87},{"$f":"COLUMN(Scenarios!CJ$1)","v":88},{"$f":"COLUMN(Scenarios!CK$1)","v":89}]
[null,null,"","",null,"",null,"",null,"",null,"",null,"",null,"",null,null,null,null,null,null,null,null,null,null,null,null,null,null,null,null,null,null,null,null,null,null,null,null,null,null,null,null,{"$f":"IF(VLOOKUP($C$164,Scenarios!$A$3:$DZ$994,BA118,0)=\"\",\"\",VLOOKUP($C$164,Scenarios!$A$3:$DZ$994,BA118,0))","v":{"$error":"#N/A"}},null,{"$f":"IF(VLOOKUP($C$164,Scenarios!$A$3:$DZ$994,BB118,0)=\"\",\"\",VLOOKUP($C$164,Scenarios!$A$3:$DZ$994,BB118,0))","v":{"$error":"#N/A"}},{"$f":"IF(VLOOKUP($C$164,Scenarios!$A$3:$DZ$994,BC118,0)=\"\",\"\",VLOOKUP($C$164,Scenarios!$A$3:$DZ$994,BC118,0))","v":{"$error":"#N/A"}},{"$f":"IF(VLOOKUP($C$164,Scenarios!$A$3:$DZ$994,BD118,0)=\"\",\"\",VLOOKUP($C$164,Scenarios!$A$3:$DZ$994,BD118,0))","v":{"$error":"#N/A"}},{"$f":"IF(VLOOKUP($C$164,Scenarios!$A$3:$DZ$994,BE118,0)=\"\",\"\",VLOOKUP($C$164,Scenarios!$A$3:$DZ$994,BE118,0))","v":{"$error":"#N/A"}},{"$f":"IF(VLOOKUP($C$164,Scenarios!$A$3:$DZ$994,BF118,0)=\"\",\"\",VLOOKUP($C$164,Scenarios!$A$3:$DZ$994,BF118,0))","v":{"$error":"#N/A"}},{"$f":"IF(VLOOKUP($C$164,Scenarios!$A$3:$DZ$994,BG118,0)=\"\",\"\",VLOOKUP($C$164,Scenarios!$A$3:$DZ$994,BG118,0))","v":{"$error":"#N/A"}},{"$f":"COLUMN(Scenarios!CL$1)","v":90},{"$f":"COLUMN(Scenarios!CM$1)","v":91},{"$f":"COLUMN(Scenarios!CN$1)","v":92},{"$f":"COLUMN(Scenarios!CO$1)","v":93},{"$f":"COLUMN(Scenarios!CP$1)","v":94},{"$f":"COLUMN(Scenarios!CQ$1)","v":95},{"$f":"COLUMN(Scenarios!CR$1)","v":96}]
[]
[]
[null,null,{"$f":"IF(L80>0,\"Which of these mowers will you use to mow the 'unmowed' area that you only mow \"&L80&\" times per season?\",\"\")","v":"Which of these mowers will you use to mow the 'unmowed' area that you only mow  times per season?"},null,null,null,null,null,null,null,null,null,null,"","","",null,null,null,null,null,null,null,null,null,null,null,null,null,null,null,null,null,null,null,null,null,null,null,null,null,null,null,null,null,null,null,null,null,{"$f":"IF(VLOOKUP($C$164,Scenarios!$A$3:$DZ$994,BA121,0)=\"\",\"\",VLOOKUP($C$164,Scenarios!$A$3:$DZ$994,BA121,0))","v":{"$error":"#N/A"}},null,null,{"$f":"COLUMN(Scenarios!CS1)","v":97}]
[]
[]
[]
[false,null,"Irrigating less.",null,null,null,null,null,null,null,null,null,null,null,null,null,null,null,null,null,null,null,null,null,null,null,null,null,null,null,null,null,null,null,null,null,null,null,null,null,null,null,null,null,null,null,null,null,null,null,null,{"$f":"VLOOKUP($C$164,Scenarios!$A$3:$DZ$994,BA125,0)","v":{"$error":"#N/A"}},{"$f":"COLUMN(Scenarios!CT21)","v":98}]
[]
[null,null,{"$f":"\"Under the new scenario you plan to mow approximately \"&F78&\" acres.\"","v":"Under the new scenario you plan to mow approximately 0 acres."}]
[]
[null,null,null,null,null,null,null,null,null," What percent of this land do you plan to irrigate?",null,"","%",{"$f":"IFERROR(L129/100*F78,0)","v":0},"acres",null,null,null,null,null,null,null,null,null,null,null,null,null,null,null,null,null,null,null,null,null,null,null,null,null,null,null,null,null,null,null,null,null,null,null,null,{"$f":"IF(VLOOKUP($C$164,Scenarios!$A$3:$DZ$994,BA129,0)=\"\",\"\",VLOOKUP($C$164,Scenarios!$A$3:$DZ$994,BA129,0))","v":{"$error":"#N/A"}},{"$f":"COLUMN(Scenarios!CU25)","v":99}]
[]
[null,null,null,null,null,null,null,null,null,"How often?",null,"","times per season",null,null,null,null,null,null,null,null,null,null,null,null,null,null,null,null,null,null,null,null,null,null,null,null,null,null,null,null,null,null,null,null,null,null,null,null,null,null,{"$f":"IF(VLOOKUP($C$164,Scenarios!$A$3:$DZ$994,BA131,0)=\"\",\"\",VLOOKUP($C$164,Scenarios!$A$3:$DZ$994,BA131,0))","v":{"$error":"#N/A"}},{"$f":"COLUMN(Scenarios!CV27)","v":100}]
[]
[null,null,null,null,null,null,null,null,null,"How much water do you use?",null,1,"inch(es) per irrigation cycle",null,null,null,null,null,null,null,null,null,null,null,null,null,null,null,null,null,null,null,null,null,null,null,null,null,null,null,null,null,null,null,null,null,null,null,null,null,null,{"$f":"IF(VLOOKUP($C$164,Scenarios!$A$3:$DZ$994,BA133,0)=\"\",\"\",VLOOKUP($C$164,Scenarios!$A$3:$DZ$994,BA133,0))","v":{"$error":"#N/A"}},{"$f":"COLUMN(Scenarios!CW29)","v":101}]
[]
[{"$f":"IF(F78=J21,\"off\",\"on\")","v":"on"}]
["no",null,{"$f":"IF(F78=J21,\"\",\"Do you plan to irrigate the \"&IFERROR(J21-F78,0)&\" acres you no longer mow?\")","v":"Do you plan to irrigate the 0 acres you no longer mow?"},null,null,null,null,null,null,null,null,"no",null,null,null,null,null,null,null,null,null,null,null,null,null,null,null,null,null,null,null,null,null,null,null,null,null,null,null,null,null,null,null,null,null,null,null,null,null,null,null,{"$f":"IF(VLOOKUP($C$164,Scenarios!$A$3:$DZ$994,BA136,0)=\"\",\"\",VLOOKUP($C$164,Scenarios!$A$3:$DZ$994,BA136,0))","v":{"$error":"#N/A"}},{"$f":"COLUMN(Scenarios!CX32)","v":102}]
[]
[null,null,null,null,null,null,null,null,null,{"$f":"IF(F78=J21,\"\", \"What percent of this land do you plan to irrigate?\")","v":"What percent of this land do you plan to irrigate?"},null,"",{"$f":"IF(F78=J21,\"\",\"%\")","v":"%"},{"$f":"IFERROR(L138/100*(J21-F78),0)","v":0},{"$f":"IF(F78=J21,\"\",\"acres\")","v":"acres"},null,null,null,null,null,null,null,null,null,null,null,null,null,null,null,null,null,null,null,null,null,null,null,null,null,null,null,null,null,null,null,null,null,null,null,null,{"$f":"IF(VLOOKUP($C$164,Scenarios!$A$3:$DZ$994,BA138,0)=\"\",\"\",VLOOKUP($C$164,Scenarios!$A$3:$DZ$994,BA138,0))","v":{"$error":"#N/A"}},{"$f":"COLUMN(Scenarios!CY34)","v":103}]
[]
[null,null,null,null,null,null,null,null,null,{"$f":"IF(F78=J21,\"\",\"How often?\")","v":"How often?"},null,"",{"$f":"IF(F78=J21,\"\",\"times per season\")","v":"times per season"},null,null,null,null,null,null,null,null,null,null,null,null,null,null,null,null,null,null,null,null,null,null,null,null,null,null,null,null,null,null,null,null,null,null,null,null,null,null,{"$f":"IF(VLOOKUP($C$164,Scenarios!$A$3:$DZ$994,BA140,0)=\"\",\"\",VLOOKUP($C$164,Scenarios!$A$3:$DZ$994,BA140,0))","v":{"$error":"#N/A"}},{"$f":"COLUMN(Scenarios!CZ36)","v":104}]
[]
[null,null,null,null,null,null,null,null,null,{"$f":"IF(F78=J21,\"\",\"How much water do you use?\")","v":"How much water do you use?"},null,1,{"$f":"IF(F78=J21,\"\",\"inch(es) per irrigation cycle\")","v":"inch(es) per irrigation cycle"},null,null,null,null,null,null,null,null,null,null,null,null,null,null,null,null,null,null,null,null,null,null,null,null,null,null,null,null,null,null,null,null,null,null,null,null,null,null,{"$f":"IF(VLOOKUP($C$164,Scenarios!$A$3:$DZ$994,BA142,0)=\"\",\"\",VLOOKUP($C$164,Scenarios!$A$3:$DZ$994,BA142,0))","v":{"$error":"#N/A"}},{"$f":"COLUMN(Scenarios!DA38)","v":105}]
[]
[null,null,null,"Click the buttons to the right to access information on best practices in these areas."]
[]
[]
[null,"Store this scenario"]
[]
[null,null,"Want to store the above scenario to review later?  To do so, provide a name for the scenario below and click the \"Store Scenario\" button.  Doing so will store the values you've entered above as a scenario that you can recall later. This is an optional feature that allows you to store multiple scenarios in the Mowing Calculator without creating multiple files. To recall the scenario, go to the Recall a Scenario section below."]
[null,null,"Please note: storing a scenario does not save the file.  To save the file, click the \"Save File\" button in the header of this sheet."]
[null,null,"Enter a name for the scenario"]
[]
[null,null,"Please use letters and numbers only."]
[]
[]
[]
[]
[null,"Recall a scenario"]
[]
[null,null,"You can recall any stored scenario by selecting it from the dropdown list below and clicking the \"Recall Scenario\" button."]
[null,null,"When you recall a scenario, data from the stored scenario will be populated in the calculators above."]
[]
[null,null,"Select a scenario to recall"]
[null,null,"Select a scenario..."]
[]
[]
[]
[null,"* Fuel Saving units are in gallons of gasoline equivalent (GGE) for fuels other than gasoline.  A GGE is the amount of fuel it takes to equal the energy content of one liquid gallon of gasoline.  It is used here to present fuel savings even if you change the fuels used by the mower."]
[]
[null,"** lbsCO2e (pounds of carbon dioxide equivalent) are units used to report greenhouse gas (GHG) savings.  GHGs include carbon dioxide, methane, and nitrous oxide, among others.  GHGs vary in how much they heat the atmosphere and how long they stay in the atmosphere, which can be expressed numericall as a global warming potential (GWP).  For reporting purposes GHGs like methane and nitrous oxide are converted to an equivalent amount of carbon dioxide using their GWP."]

{"sheet":"Calculations","index":3,"n_rows":239,"n_cols":69,"rows_kept":239,"cut":false,"hidden":false,"merged":[]}
[]
[null,"Calculations"]
[]
[]
[null,"This sheet presents the calculations used on the previous sheet.  Factors used in the Calculations sheet can be found on the Factors sheet."]
[]
[]
[null,"Current Scenario"]
[]
[null,"This section presents the calculations for the baseline (or current conditions) scenario."]
[]
[null,"Primary Inputs"]
[null,null,"Mowed Acres:",null,{"$f":"IFERROR('Mowing Scenario'!J21,0)","v":""},"acres"]
[null,null,"Mowing Frequency:",null,{"$f":"IFERROR('Mowing Scenario'!J23,0)","v":7},"days"]
[null,null,"Season Length:",null,{"$f":"IFERROR('Mowing Scenario'!J25,0)","v":26},"weeks"]
[null,null,"Mow Occurences:",null,{"$f":"IFERROR(E15*7/E14,0)","v":26},"times"]
[null,null,"One or Multiple Mowers?",null,{"$f":"IF('Mowing Scenario'!A30=TRUE,\"Single\",\"Multiple\")","v":"Single"}]
[]
[null,"Calculations for a Single Mower Baseline Scenario"]
[]
[null,"Single Mower Specifications"]
[null,null,"Deck Size:",null,{"$f":"IFERROR('Mowing Scenario'!J34,0)","v":46},"inches"]
[null,null,"Horsepower:",null,{"$f":"IFERROR('Mowing Scenario'!J36,0)","v":20},"hp"]
[null,null,"Fuel Type:",null,{"$f":"IFERROR('Mowing Scenario'!J38,\"\")","v":"Gasoline"}]
[null,null,"Fuel Cost:",null,{"$f":"IFERROR('Mowing Scenario'!J40,0)","v":3.7},"$/gallon"]
[null,null,"Mow Speed:",null,{"$f":"IFERROR('Mowing Scenario'!J43,0)","v":5},"mph"]
[]
[null,"Hours Spent Mowing (Single Mower)"]
[null,null,"Mow Rate Coefficient",null,"Swath overlap",null,"Deck Size (in)",null,"Mow speed (mph)",null,"Mow time (hours/acre)",null,"Acres",null,"Hours/Mow",null,"Mow Occurences",null,"Total Hours"]
[null,null,{"$f":"Factors!B64","v":108.9},"/",{"$f":"Factors!D64","v":0.9},"x",{"$f":"E22","v":46},"x",{"$f":"E26","v":5},"=",{"$f":"IFERROR(C30/(E30*G30*I30),0)","v":0.5260869565217392},"x",{"$f":"$E$13","v":""},"=",{"$f":"IFERROR(K30*M30,0)","v":0},"x",{"$f":"IFERROR(E16,0)","v":26},"=",{"$f":"Q30*O30","v":0}]
[]
[null,"Fuel Consumed Mowing and Fuel Costs (Single Mower)"]
[null,null,"Hours",null,"Horsepower",null,"hp-hr",null,"BSCF (Btu/hp-hr)",null,"Energy (Btu)",null,"Btu/gallon",null,"Gallons",null,"Fuel Cost ($/gallon)",null,"Fuel Costs"]
[null,null,{"$f":"S30","v":0},"*",{"$f":"E23","v":20},"=",{"$f":"C34*E34","v":0},"x",{"$f":"VLOOKUP(E24,Factors!$B$71:$C$73,2,0)","v":9039},"=",{"$f":"G34*I34","v":0},"/",{"$f":"VLOOKUP(E24,Factors!$B$71:$E$73,4,0)","v":125000},"=",{"$f":"K34/M34","v":0},"x",{"$f":"E25","v":3.7},"=",{"$f":"Q34*O34","v":0}]
[]
[null,null,null,null,null,null,null,null,null,null,null,null,null,null,"Gallons",null,"GGE/Gallon",null,"Fuel Consumption (GGE)"]
[null,null,null,null,null,null,null,null,null,null,null,null,null,null,{"$f":"O34","v":0},"x",{"$f":"VLOOKUP(E24,Factors!$B$32:$E$41,4,0)","v":1},"=",{"$f":"IFERROR(Q37*O37,O37)","v":0}]
[null,"GHG Emissions Produced Mowing (Single Mower)"]
[null,null,null,null,"MMBtu",null,"kgCO2e/MMBtu",null,"GHGs (kgCO2e)",null,"lbs/kg",null,"GHGs (lbsCO2e)"]
[null,null,"Upstream",null,{"$f":"K34/Factors!$K$112","v":0},"x",{"$f":"VLOOKUP($E$24,Factors!$B$56:$D$58,2,0)","v":0},"=",{"$f":"G40*E40","v":0},"x",{"$f":"Factors!$I$134","v":2.2046000000000001},"=",{"$f":"K40*I40","v":0}]
[null,null,"CO2e",null,{"$f":"K34/Factors!$K$112","v":0},"x",{"$f":"VLOOKUP($E$24,Factors!$B$56:$D$58,3,0)","v":71.418199999999999},"=",{"$f":"G41*E41","v":0},"x",{"$f":"Factors!$I$134","v":2.2046000000000001},"=",{"$f":"K41*I41","v":0}]
[]
[null,null,"Total",null,"NA",null,"NA",null,{"$f":"SUM(I40:I41)","v":0},null,"NA",null,{"$f":"SUM(M40:M41)","v":0}]
[]
[null,"Pollutants Produced Mowing (Single Mower)"]
[null,null,null,null,"hp-hr",null,"g/hp-hr",null,"Pollutant (grams)",null,"lbs/g",null,"Pollutants (lbs)"]
[null,null,"HC",null,{"$f":"$G$34","v":0},"x",{"$f":"VLOOKUP($E$24,Factors!$G$56:$K$58,MATCH(Calculations!$C47,Factors!$G$54:$K$54,0),0)","v":0.27},"=",{"$f":"G47*E47","v":0},"x",{"$f":"Factors!$I$133","v":2.2000000000000001E-3},"=",{"$f":"K47*I47","v":0}]
[null,null,"CO",null,{"$f":"$G$34","v":0},"x",{"$f":"VLOOKUP($E$24,Factors!$G$56:$K$58,MATCH(Calculations!$C48,Factors!$G$54:$K$54,0),0)","v":11.94},"=",{"$f":"G48*E48","v":0},"x",{"$f":"Factors!$I$133","v":2.2000000000000001E-3},"=",{"$f":"K48*I48","v":0}]
[null,null,"NOx",null,{"$f":"$G$34","v":0},"x",{"$f":"VLOOKUP($E$24,Factors!$G$56:$K$58,MATCH(Calculations!$C49,Factors!$G$54:$K$54,0),0)","v":0.69},"=",0,"x",{"$f":"Factors!$I$133","v":2.2000000000000001E-3},"=",0]
[null,null,"PM",null,{"$f":"$G$34","v":0},"x",{"$f":"VLOOKUP($E$24,Factors!$G$56:$K$58,MATCH(Calculations!$C50,Factors!$G$54:$K$54,0),0)","v":7.7},"=",0,"x",{"$f":"Factors!$I$133","v":2.2000000000000001E-3},"=",0]
[]
[null,"Calculations for a Multiple Mower Baseline Scenario"]
[]
[null,"Multiple Mower Specifications"]
[]
[null,null,"Name",null,"Deck Size (in)",null,"Horsepower (hp)",null,"Fuel Type",null,"Fuel Cost ($/gallon)",null,"Mow speed (mph)",null,"% of total acres"]
[null,"1)",{"$f":"'Mowing Scenario'!C49","v":""},null,{"$f":"'Mowing Scenario'!F49","v":46},null,{"$f":"'Mowing Scenario'!H49","v":20},null,{"$f":"'Mowing Scenario'!J49","v":"Gasoline"},null,{"$f":"'Mowing Scenario'!L49","v":3.7},null,{"$f":"'Mowing Scenario'!N49","v":5},null,{"$f":"'Mowing Scenario'!P49","v":100}]
[null,"2)",{"$f":"'Mowing Scenario'!C50","v":""},null,{"$f":"'Mowing Scenario'!F50","v":""},null,{"$f":"'Mowing Scenario'!H50","v":""},null,{"$f":"'Mowing Scenario'!J50","v":""},null,{"$f":"'Mowing Scenario'!L50","v":""},null,{"$f":"'Mowing Scenario'!N50","v":""},null,{"$f":"'Mowing Scenario'!P50","v":""}]
[null,"3)",{"$f":"'Mowing Scenario'!C51","v":""},null,{"$f":"'Mowing Scenario'!F51","v":""},null,{"$f":"'Mowing Scenario'!H51","v":""},null,{"$f":"'Mowing Scenario'!J51","v":""},null,{"$f":"'Mowing Scenario'!L51","v":""},null,{"$f":"'Mowing Scenario'!N51","v":""},null,{"$f":"'Mowing Scenario'!P51","v":""}]
[null,"4)",{"$f":"'Mowing Scenario'!C52","v":""},null,{"$f":"'Mowing Scenario'!F52","v":""},null,{"$f":"'Mowing Scenario'!H52","v":""},null,{"$f":"'Mowing Scenario'!J52","v":""},null,{"$f":"'Mowing Scenario'!L52","v":""},null,{"$f":"'Mowing Scenario'!N52","v":""},null,{"$f":"'Mowing Scenario'!P52","v":""}]
[null,"5)",{"$f":"'Mowing Scenario'!C53","v":""},null,{"$f":"'Mowing Scenario'!F53","v":""},null,{"$f":"'Mowing Scenario'!H53","v":""},null,{"$f":"'Mowing Scenario'!J53","v":""},null,{"$f":"'Mowing Scenario'!L53","v":""},null,{"$f":"'Mowing Scenario'!N53","v":""},null,{"$f":"'Mowing Scenario'!P53","v":""}]
[]
[null,"Fuel Consumed Mowing and Fuel Costs (Multiple Mowers)"]
[]
[null,null,"Name",null,"Mow Rate Coefficient",null,"Swath overlap",null,"Deck Size (in)",null,"Mow speed (mph)",null,"Mow time (hours/acre)",null,"% of total acres",null,"Acres",null,"Hours/Mow",null,"Mow Occurences",null,"Total Hours",null,"Horsepower",null,"hp-hr",null,"BSCF (Btu/hp-hr)",null,"Energy (Btu)",null,"Btu/gallon",null,"Gallons",null,"Fuel Cost ($/gallon)",null,"Fuel Costs"]
[null,"1)",{"$f":"C57","v":""},null,{"$f":"Factors!$B$64","v":108.9},"/",{"$f":"Factors!$D$64","v":0.9},"x",{"$f":"E57","v":46},"x",{"$f":"M57","v":5},"=",{"$f":"IFERROR(E66/(G66*I66*K66),0)","v":0.5260869565217392},"x",{"$f":"IFERROR(O57/100,0)","v":1},"x",{"$f":"$E$13","v":""},"=",{"$f":"IFERROR(Q66*O66*M66,0)","v":0},"x",{"$f":"$E$16","v":26},"=",{"$f":"U66*S66","v":0},"x",{"$f":"G57","v":20},"=",{"$f":"IFERROR(Y66*W66,0)","v":0},"x",{"$f":"IFERROR(VLOOKUP(I57,Factors!$B$71:$C$73,2,0),0)","v":9039},"=",{"$f":"AC66*AA66","v":0},"x",{"$f":"IFERROR(VLOOKUP(I57,Factors!$B$71:$E$73,4,0),0)","v":125000},"=",{"$f":"IFERROR(AE66/AG66,0)","v":0},"x",{"$f":"K57","v":3.7},"=",{"$f":"IFERROR(AK66*AI66,0)","v":0}]
[null,"2)",{"$f":"C58","v":""},null,{"$f":"Factors!$B$64","v":108.9},"/",{"$f":"Factors!$D$64","v":0.9},"x",{"$f":"E58","v":""},"x",{"$f":"M58","v":""},"=",{"$f":"IFERROR(E67/(G67*I67*K67),0)","v":0},"x",{"$f":"IFERROR(O58/100,0)","v":0},"x",{"$f":"$E$13","v":""},"=",{"$f":"IFERROR(Q67*O67*M67,0)","v":0},"x",{"$f":"$E$16","v":26},"=",{"$f":"U67*S67","v":0},"x",{"$f":"G58","v":""},"=",{"$f":"IFERROR(Y67*W67,0)","v":0},"x",{"$f":"IFERROR(VLOOKUP(I58,Factors!$B$71:$C$73,2,0),0)","v":0},"=",{"$f":"AC67*AA67","v":0},"x",{"$f":"IFERROR(VLOOKUP(I58,Factors!$B$71:$E$73,4,0),0)","v":0},"=",{"$f":"IFERROR(AE67/AG67,0)","v":0},"x",{"$f":"K58","v":""},"=",{"$f":"IFERROR(AK67*AI67,0)","v":0}]
[null,"3)",{"$f":"C59","v":""},null,{"$f":"Factors!$B$64","v":108.9},"/",{"$f":"Factors!$D$64","v":0.9},"x",{"$f":"E59","v":""},"x",{"$f":"M59","v":""},"=",0,"x",0,"x","","=",0,"x",26,"=",0,"x",{"$f":"G59","v":""},"=",0,"x",{"$f":"IFERROR(VLOOKUP(I59,Factors!$B$71:$C$73,2,0),0)","v":0},"=",{"$f":"AC68*AA68","v":0},"x",{"$f":"IFERROR(VLOOKUP(I59,Factors!$B$71:$E$73,4,0),0)","v":0},"=",0,"x",{"$f":"K59","v":""},"=",0]
[null,"4)",{"$f":"C60","v":""},null,{"$f":"Factors!$B$64","v":108.9},"/",{"$f":"Factors!$D$64","v":0.9},"x",{"$f":"E60","v":""},"x",{"$f":"M60","v":""},"=",0,"x",0,"x","","=",0,"x",26,"=",0,"x",{"$f":"G60","v":""},"=",0,"x",{"$f":"IFERROR(VLOOKUP(I60,Factors!$B$71:$C$73,2,0),0)","v":0},"=",{"$f":"AC69*AA69","v":0},"x",{"$f":"IFERROR(VLOOKUP(I60,Factors!$B$71:$E$73,4,0),0)","v":0},"=",0,"x",{"$f":"K60","v":""},"=",0]
[null,"5)",{"$f":"C61","v":""},null,{"$f":"Factors!$B$64","v":108.9},"/",{"$f":"Factors!$D$64","v":0.9},"x",{"$f":"E61","v":""},"x",{"$f":"M61","v":""},"=",0,"x",0,"x","","=",0,"x",26,"=",0,"x",{"$f":"G61","v":""},"=",0,"x",{"$f":"IFERROR(VLOOKUP(I61,Factors!$B$71:$C$73,2,0),0)","v":0},"=",{"$f":"AC70*AA70","v":0},"x",{"$f":"IFERROR(VLOOKUP(I61,Factors!$B$71:$E$73,4,0),0)","v":0},"=",0,"x",{"$f":"K61","v":""},"=",0]
[]
[null,null,"Total",null,null,null,null,null,null,null,null,null,null,null,null,null,null,null,{"$f":"IFERROR(SUM(S66:S70),0)","v":0},null,null,null,{"$f":"SUM(W66:W70)","v":0},null,null,null,{"$f":"IFERROR(SUM(AA66:AA70),0)","v":0},null,null,null,{"$f":"IFERROR(SUM(AE66:AE70),0)","v":0},null,null,null,{"$f":"IFERROR(SUM(AI66:AI70),0)","v":0},null,null,null,{"$f":"IFERROR(SUM(AM66:AM70),0)","v":0}]
[]
[null,"Fuel Consumed in Gasoline Gallon Equivalents (Multiple Mowers)"]
[null,null,null,null,"Gallons",null,"GGE/Gallon",null,"Fuel Consumption (GGE)"]
[null,null,{"$f":"C66","v":""},null,{"$f":"AI66","v":0},"x",{"$f":"IFERROR(VLOOKUP(I57,Factors!$B$32:$E$41,4,0),0)","v":1},"=",{"$f":"IFERROR(G76*E76,E76)","v":0}]
[null,null,{"$f":"C67","v":""},null,{"$f":"AI67","v":0},"x",{"$f":"IFERROR(VLOOKUP(I58,Factors!$B$32:$E$41,4,0),0)","v":0},"=",{"$f":"IFERROR(G77*E77,E77)","v":0}]
[null,null,{"$f":"C68","v":""},null,{"$f":"AI68","v":0},"x",{"$f":"IFERROR(VLOOKUP(I59,Factors!$B$32:$E$41,4,0),0)","v":0},"=",0]
[null,null,{"$f":"C69","v":""},null,{"$f":"AI69","v":0},"x",{"$f":"IFERROR(VLOOKUP(I60,Factors!$B$32:$E$41,4,0),0)","v":0},"=",0]
[null,null,{"$f":"C70","v":""},null,{"$f":"AI70","v":0},"x",{"$f":"IFERROR(VLOOKUP(I61,Factors!$B$32:$E$41,4,0),0)","v":0},"=",0]
[]
[null,null,"Total",null,null,null,null,null,{"$f":"SUM(I76:I80)","v":0}]
[]
[null,"GHGs and Pollutants Produced Mowing (Multiple Mowers by Mower)"]
[]
[null,null,{"$f":"C66","v":""},null,null,null,null,null,null,null,null,null,null,null,null,null,{"$f":"C58","v":""},null,null,null,null,null,null,null,null,null,null,null,null,null,{"$f":"C59","v":""},null,null,null,null,null,null,null,null,null,null,null,null,null,{"$f":"C60","v":""},null,null,null,null,null,null,null,null,null,null,null,null,null,{"$f":"C70","v":""}]
[null,null,null,null,"MMBtu",null,"kgCO2e/MMBtu",null,"GHGs (kgCO2e)",null,"lbs/kg",null,"GHGs (lbsCO2e)",null,null,null,null,null,"MMBtu",null,"kgCO2e/MMBtu",null,"GHGs (kgCO2e)",null,"lbs/kg",null,"GHGs (lbsCO2e)",null,null,null,null,null,"MMBtu",null,"kgCO2e/MMBtu",null,"GHGs (kgCO2e)",null,"lbs/kg",null,"GHGs (lbsCO2e)",null,null,null,null,null,"MMBtu",null,"kgCO2e/MMBtu",null,"GHGs (kgCO2e)",null,"lbs/kg",null,"GHGs (lbsCO2e)",null,null,null,null,null,"MMBtu",null,"kgCO2e/MMBtu",null,"GHGs (kgCO2e)",null,"lbs/kg",null,"GHGs (lbsCO2e)"]
[null,null,"Upstream CO2",null,{"$f":"$AE$66/Factors!$K$112","v":0},"x",{"$f":"VLOOKUP($I$57,Factors!$B$56:$D$58,2,0)","v":0},"=",{"$f":"G88*E88","v":0},"x",{"$f":"Factors!$I$134","v":2.2046000000000001},"=",{"$f":"K88*I88","v":0},null,null,null,"Upstream CO2",null,{"$f":"$AE$67/Factors!$K$112","v":0},"x",{"$f":"IFERROR(VLOOKUP($I$58,Factors!$B$56:$D$58,2,0),0)","v":0},"=",{"$f":"U88*S88","v":0},"x",{"$f":"Factors!$I$134","v":2.2046000000000001},"=",{"$f":"Y88*W88","v":0},null,null,null,"Upstream CO2",null,{"$f":"$AE$68/Factors!$K$112","v":0},"x",{"$f":"IFERROR(VLOOKUP($I$59,Factors!$B$56:$D$58,2,0),0)","v":0},"=",{"$f":"AI88*AG88","v":0},"x",{"$f":"Factors!$I$134","v":2.2046000000000001},"=",{"$f":"AM88*AK88","v":0},null,null,null,"Upstream CO2",null,{"$f":"$AE$69/Factors!$K$112","v":0},"x",{"$f":"IFERROR(VLOOKUP($I$60,Factors!$B$56:$D$58,2,0),0)","v":0},"=",{"$f":"AW88*AU88","v":0},"x",{"$f":"Factors!$I$134","v":2.2046000000000001},"=",{"$f":"BA88*AY88","v":0},null,null,null,"Upstream CO2",null,{"$f":"$AE$70/Factors!$K$112","v":0},"x",{"$f":"IFERROR(VLOOKUP($I$61,Factors!$B$56:$D$58,2,0),0)","v":0},"=",{"$f":"BK88*BI88","v":0},"x",{"$f":"Factors!$I$134","v":2.2046000000000001},"=",{"$f":"BO88*BM88","v":0}]
[null,null,"CO2e",null,{"$f":"$AE$66/Factors!$K$112","v":0},"x",{"$f":"VLOOKUP($I$57,Factors!$B$56:$D$58,3,0)","v":71.418199999999999},"=",{"$f":"G89*E89","v":0},"x",{"$f":"Factors!$I$134","v":2.2046000000000001},"=",{"$f":"K89*I89","v":0},null,null,null,"CO2e",null,{"$f":"$AE$67/Factors!$K$112","v":0},"x",{"$f":"IFERROR(VLOOKUP($I$58,Factors!$B$56:$D$58,3,0),0)","v":0},"=",{"$f":"U89*S89","v":0},"x",{"$f":"Factors!$I$134","v":2.2046000000000001},"=",{"$f":"Y89*W89","v":0},null,null,null,"CO2e",null,{"$f":"$AE$68/Factors!$K$112","v":0},"x",{"$f":"IFERROR(VLOOKUP($I$59,Factors!$B$56:$D$58,3,0),0)","v":0},"=",{"$f":"AI89*AG89","v":0},"x",{"$f":"Factors!$I$134","v":2.2046000000000001},"=",{"$f":"AM89*AK89","v":0},null,null,null,"CO2e",null,{"$f":"$AE$69/Factors!$K$112","v":0},"x",{"$f":"IFERROR(VLOOKUP($I$60,Factors!$B$56:$D$58,3,0),0)","v":0},"=",{"$f":"AW89*AU89","v":0},"x",{"$f":"Factors!$I$134","v":2.2046000000000001},"=",{"$f":"BA89*AY89","v":0},null,null,null,"CO2e",null,{"$f":"$AE$70/Factors!$K$112","v":0},"x",{"$f":"IFERROR(VLOOKUP($I$61,Factors!$B$56:$D$58,3,0),0)","v":0},"=",{"$f":"BK89*BI89","v":0},"x",{"$f":"Factors!$I$134","v":2.2046000000000001},"=",{"$f":"BO89*BM89","v":0}]
[]
[null,null,null,null,"hp-hr",null,"g/hp-hr",null,"Pollutant (grams)",null,"lbs/g",null,"Pollutants (lbs)",null,null,null,null,null,"hp-hr",null,"g/hp-hr",null,"Pollutant (grams)",null,"lbs/g",null,"Pollutants (lbs)",null,null,null,null,null,"hp-hr",null,"g/hp-hr",null,"Pollutant (grams)",null,"lbs/g",null,"Pollutants (lbs)",null,null,null,null,null,"hp-hr",null,"g/hp-hr",null,"Pollutant (grams)",null,"lbs/g",null,"Pollutants (lbs)",null,null,null,null,null,"hp-hr",null,"g/hp-hr",null,"Pollutant (grams)",null,"lbs/g",null,"Pollutants (lbs)"]
[null,null,"HC",null,{"$f":"$AA$66","v":0},"x",{"$f":"VLOOKUP($I$57,Factors!$G$56:$K$58,2,0)","v":0.27},"=",{"$f":"G92*E92","v":0},"x",{"$f":"Factors!$I$133","v":2.2000000000000001E-3},"=",{"$f":"K92*I92","v":0},null,null,null,"HC",null,{"$f":"$AA$67","v":0},"x",{"$f":"IFERROR(VLOOKUP($I$58,Factors!$G$56:$K$58,2,0),0)","v":0},"=",{"$f":"U92*S92","v":0},"x",{"$f":"Factors!$I$133","v":2.2000000000000001E-3},"=",{"$f":"Y92*W92","v":0},null,null,null,"HC",null,{"$f":"$AA$68","v":0},"x",{"$f":"IFERROR(VLOOKUP($I$59,Factors!$G$56:$K$58,2,0),0)","v":0},"=",{"$f":"AI92*AG92","v":0},"x",{"$f":"Factors!$I$133","v":2.2000000000000001E-3},"=",{"$f":"AM92*AK92","v":0},null,null,null,"HC",null,{"$f":"$AA$69","v":0},"x",{"$f":"IFERROR(VLOOKUP($I$60,Factors!$G$56:$K$58,2,0),0)","v":0},"=",{"$f":"AW92*AU92","v":0},"x",{"$f":"Factors!$I$133","v":2.2000000000000001E-3},"=",{"$f":"BA92*AY92","v":0},null,null,null,"HC",null,{"$f":"$AA$70","v":0},"x",{"$f":"IFERROR(VLOOKUP($I$61,Factors!$G$56:$K$58,2,0),0)","v":0},"=",{"$f":"BK92*BI92","v":0},"x",{"$f":"Factors!$I$133","v":2.2000000000000001E-3},"=",{"$f":"BO92*BM92","v":0}]
[null,null,"CO",null,{"$f":"$AA$66","v":0},"x",{"$f":"VLOOKUP($I$57,Factors!$G$56:$K$58,3,0)","v":11.94},"=",{"$f":"G93*E93","v":0},"x",{"$f":"Factors!$I$133","v":2.2000000000000001E-3},"=",0,null,null,null,"CO",null,{"$f":"$AA$67","v":0},"x",{"$f":"IFERROR(VLOOKUP($I$58,Factors!$G$56:$K$58,3,0),0)","v":0},"=",{"$f":"U93*S93","v":0},"x",{"$f":"Factors!$I$133","v":2.2000000000000001E-3},"=",{"$f":"Y93*W93","v":0},null,null,null,"CO",null,{"$f":"$AA$68","v":0},"x",{"$f":"IFERROR(VLOOKUP($I$59,Factors!$G$56:$K$58,3,0),0)","v":0},"=",{"$f":"AI93*AG93","v":0},"x",{"$f":"Factors!$I$133","v":2.2000000000000001E-3},"=",0,null,null,null,"CO",null,{"$f":"$AA$69","v":0},"x",{"$f":"IFERROR(VLOOKUP($I$60,Factors!$G$56:$K$58,3,0),0)","v":0},"=",{"$f":"AW93*AU93","v":0},"x",{"$f":"Factors!$I$133","v":2.2000000000000001E-3},"=",0,null,null,null,"CO",null,{"$f":"$AA$70","v":0},"x",{"$f":"IFERROR(VLOOKUP($I$61,Factors!$G$56:$K$58,3,0),0)","v":0},"=",{"$f":"BK93*BI93","v":0},"x",{"$f":"Factors!$I$133","v":2.2000000000000001E-3},"=",0]
[null,null,"NOx",null,{"$f":"$AA$66","v":0},"x",{"$f":"VLOOKUP($I$57,Factors!$G$56:$K$58,4,0)","v":0.69},"=",0,"x",{"$f":"Factors!$I$133","v":2.2000000000000001E-3},"=",0,null,null,null,"NOx",null,{"$f":"$AA$67","v":0},"x",{"$f":"IFERROR(VLOOKUP($I$58,Factors!$G$56:$K$58,4,0),0)","v":0},"=",{"$f":"U94*S94","v":0},"x",{"$f":"Factors!$I$133","v":2.2000000000000001E-3},"=",{"$f":"Y94*W94","v":0},null,null,null,"NOx",null,{"$f":"$AA$68","v":0},"x",{"$f":"IFERROR(VLOOKUP($I$59,Factors!$G$56:$K$58,4,0),0)","v":0},"=",0,"x",{"$f":"Factors!$I$133","v":2.2000000000000001E-3},"=",0,null,null,null,"NOx",null,{"$f":"$AA$69","v":0},"x",{"$f":"IFERROR(VLOOKUP($I$60,Factors!$G$56:$K$58,4,0),0)","v":0},"=",0,"x",{"$f":"Factors!$I$133","v":2.2000000000000001E-3},"=",0,null,null,null,"NOx",null,{"$f":"$AA$70","v":0},"x",{"$f":"IFERROR(VLOOKUP($I$61,Factors!$G$56:$K$58,4,0),0)","v":0},"=",0,"x",{"$f":"Factors!$I$133","v":2.2000000000000001E-3},"=",0]
[null,null,"PM",null,{"$f":"$AA$66","v":0},"x",{"$f":"VLOOKUP($I$57,Factors!$G$56:$K$58,5,0)","v":7.7},"=",0,"x",{"$f":"Factors!$I$133","v":2.2000000000000001E-3},"=",0,null,null,null,"PM",null,{"$f":"$AA$67","v":0},"x",{"$f":"IFERROR(VLOOKUP($I$58,Factors!$G$56:$K$58,5,0),0)","v":0},"=",{"$f":"U95*S95","v":0},"x",{"$f":"Factors!$I$133","v":2.2000000000000001E-3},"=",{"$f":"Y95*W95","v":0},null,null,null,"PM",null,{"$f":"$AA$68","v":0},"x",{"$f":"IFERROR(VLOOKUP($I$59,Factors!$G$56:$K$58,5,0),0)","v":0},"=",0,"x",{"$f":"Factors!$I$133","v":2.2000000000000001E-3},"=",0,null,null,null,"PM",null,{"$f":"$AA$69","v":0},"x",{"$f":"IFERROR(VLOOKUP($I$60,Factors!$G$56:$K$58,5,0),0)","v":0},"=",0,"x",{"$f":"Factors!$I$133","v":2.2000000000000001E-3},"=",0,null,null,null,"PM",null,{"$f":"$AA$70","v":0},"x",{"$f":"IFERROR(VLOOKUP($I$61,Factors!$G$56:$K$58,5,0),0)","v":0},"=",0,"x",{"$f":"Factors!$I$133","v":2.2000000000000001E-3},"=",0]
[]
[]
[null,null,"Total",null,"GHGs (lbsCO2e)"]
[null,null,"Upstream CO2",null,{"$f":"SUM(M88,AA88,AO88,BC88,BQ88)","v":0}]
[null,null,"CO2e",null,{"$f":"SUM(M89,AA89,AO89,BC89,BQ89)","v":0}]
[]
[null,null,"Total",null,{"$f":"SUM(E99:E100)","v":0}]
[]
[null,null,null,null,"Pollutants (lbs)"]
[null,null,"HC",null,{"$f":"SUM(M92,AA92,AO92,BC92,BQ92)","v":0}]
[null,null,"CO",null,{"$f":"SUM(M93,AA93,AO93,BC93,BQ93)","v":0}]
[null,null,"NOx",null,{"$f":"SUM(M94,AA94,AO94,BC94,BQ94)","v":0}]
[null,null,"PM",null,{"$f":"SUM(M95,AA95,AO95,BC95,BQ95)","v":0}]
[]
[]
[null,"Calculations for a Baseline Irrigation Scenario"]
[]
[null,null,"Irrigated Acres",null,"Irrigation Rate (inches per application)",null,"Irrigation Cycle Amount (gallons/ inch/ acre)",null,"Irrigation Volume (gallons/cycle)",null,"Irrigation Cycles per Season",null,"Seasonal Irrigation Volume (gallons)"]
[null,null,{"$f":"IFERROR('Mowing Scenario'!L58,0)","v":""},"x",{"$f":"IFERROR('Mowing Scenario'!J64,0)","v":1},"x",{"$f":"Factors!$H$70","v":27000},"=",{"$f":"IFERROR(C114*E114*G114,0)","v":0},"x",{"$f":"IFERROR('Mowing Scenario'!J61,0)","v":""},"=",{"$f":"IFERROR(K114*I114,0)","v":0}]
[]
[]
[]
[null,"Planned Scenario"]
[]
[null,"This section presents the calculations for the planned (or future) scenario.  The planned scenario allows you to consider several options that range from mowing less acreage to irrigating less."]
[null,"The options considered in the calculations presented below include:"]
[]
[null,{"$f":"IF('Mowing Scenario'!A71=TRUE,\"a\",\"\")","v":""},"Mow less area"]
[null,{"$f":"IF('Mowing Scenario'!A83=TRUE,\"a\",\"\")","v":""},"Mow less often"]
[null,{"$f":"IF('Mowing Scenario'!A95=TRUE,\"a\",\"\")","v":""},"Use a different type of lawn mower"]
[null,{"$f":"IF('Mowing Scenario'!A125=TRUE,\"a\",\"\")","v":""},"Irrigate less"]
[]
[null,null,"Primary Inputs"]
[null,null,null,null,"Mowed Area",null,null,null,"Unmowed Area"]
[null,null,"Mowed Acres:",null,{"$f":"IFERROR(IF(B123=\"a\",'Mowing Scenario'!F78,E13),0)","v":""},"acres",null,null,{"$f":"IFERROR('Mowing Scenario'!J21-'Mowing Scenario'!F78,0)","v":0},"acres"]
[null,null,"Mow Occurences:",null,{"$f":"IFERROR(IF(B124=\"a\",'Mowing Scenario'!F91,Q30),0)","v":26},"times",null,null,{"$f":"IFERROR('Mowing Scenario'!L80,0)","v":""},"times"]
[]
[]
[null,"Calculations for a Single Mower Planned Scenario"]
[]
[]
[null,"Single Mower Specifications"]
[null,null,"Deck Size:",null,{"$f":"IFERROR('Mowing Scenario'!L99,0)","v":""},"inches"]
[null,null,"Horsepower:",null,{"$f":"IFERROR('Mowing Scenario'!L101,0)","v":""},"hp"]
[null,null,"Fuel Type:",null,{"$f":"IFERROR('Mowing Scenario'!L103,0)","v":"Gasoline"}]
[null,null,"Fuel Cost:",null,{"$f":"IFERROR('Mowing Scenario'!L105,0)","v":""},"$/gallon"]
[null,null,"Mow Speed:",null,{"$f":"IFERROR('Mowing Scenario'!L108,0)","v":""},"mph"]
[]
[]
[null,"Hours Spent Mowing (Single Mower)"]
[null,null,null,null,"Mow Rate Coefficient",null,"Swath overlap",null,"Deck Size (in)",null,"Mow speed (mph)",null,"Mow time (hours/acre)",null,"Acres",null,"Hours/Mow",null,"Mow Occurences",null,"Total Hours"]
[null,null,"Mowed Area",null,{"$f":"Factors!$B$64","v":108.9},"/",{"$f":"Factors!$D$64","v":0.9},"x",{"$f":"IFERROR(IF($B$125=\"a\",$E$138,$E$22),0)","v":46},"x",{"$f":"IFERROR(IF($B$125=\"a\",$E$142,$E$26),0)","v":5},"=",{"$f":"IFERROR(E147/(G147*I147*K147),0)","v":0.5260869565217392},"x",{"$f":"E130","v":""},"=",{"$f":"M147*O147","v":{"$error":"#VALUE!"}},"x",{"$f":"IFERROR(E131,0)","v":26},"=",{"$f":"IFERROR(S147*Q147,0)","v":0}]
[null,null,"Unmowed Area",null,{"$f":"Factors!$B$64","v":108.9},"/",{"$f":"Factors!$D$64","v":0.9},"x",{"$f":"IFERROR(IF($B$125=\"a\",$E$138,$E$22),0)","v":46},"x",{"$f":"IFERROR(IF($B$125=\"a\",$E$142,$E$26),0)","v":5},"=",{"$f":"IFERROR(E148/(G148*I148*K148),0)","v":0.5260869565217392},"x",{"$f":"I130","v":0},"=",{"$f":"M148*O148","v":0},"x",{"$f":"I131","v":""},"=",{"$f":"IFERROR(S148*Q148,0)","v":0}]
[null,null,"Total",null,null,null,null,null,null,null,null,null,null,null,null,null,null,null,null,null,{"$f":"SUM(U147:U148)","v":0}]
[]
[null,"Fuel Consumed Mowing and Fuel Costs (Single Mower)"]
[null,null,"Hours",null,"Horsepower",null,"hp-hr",null,"BSCF (Btu/hp-hr)",null,"Energy (Btu)",null,"Btu/gallon",null,"Gallons",null,"Fuel Cost ($/gallon)",null,"Fuel Costs"]
[null,null,{"$f":"U149","v":0},"*",{"$f":"IFERROR(IF(B125=\"a\",E139,E23),0)","v":20},"=",{"$f":"IFERROR(C153*E153,0)","v":0},"x",{"$f":"VLOOKUP(E140,Factors!$B$71:$C$73,2,0)","v":9039},"=",{"$f":"G153*I153","v":0},"/",{"$f":"VLOOKUP(E140,Factors!$B$71:$E$73,4,0)","v":125000},"=",{"$f":"K153/M153","v":0},"x",{"$f":"IFERROR(IF(B125=\"a\",E141,E25),0)","v":3.7},"=",{"$f":"IFERROR(Q153*O153,0)","v":0}]
[]
[null,null,null,null,null,null,null,null,null,null,null,null,null,null,null,null,"GGE/Gallon",null,"Fuel Consumption (GGE)"]
[null,null,null,null,null,null,null,null,null,null,null,null,null,null,{"$f":"O153","v":0},"x",{"$f":"VLOOKUP(E140,Factors!$B$32:$E$41,4,0)","v":1},"=",{"$f":"IFERROR(Q156*O156,O156)","v":0}]
[null,"GHG Emissions Produced Mowing (Single Mower)"]
[null,null,null,null,"MMBtu",null,"kgCO2e/MMBtu",null,"GHGs (kgCO2e)",null,"lbs/kg",null,"GHGs (lbsCO2e)"]
[null,null,"Upstream",null,{"$f":"K153/Factors!$K$112","v":0},"x",{"$f":"VLOOKUP($E$140,Factors!$B$56:$D$58,2,0)","v":0},"=",{"$f":"G159*E159","v":0},"x",{"$f":"Factors!$I$134","v":2.2046000000000001},"=",{"$f":"K159*I159","v":0}]
[null,null,"CO2e",null,{"$f":"K153/Factors!$K$112","v":0},"x",{"$f":"VLOOKUP($E$140,Factors!$B$56:$D$58,3,0)","v":71.418199999999999},"=",{"$f":"G160*E160","v":0},"x",{"$f":"Factors!$I$134","v":2.2046000000000001},"=",{"$f":"K160*I160","v":0}]
[]
[null,null,"Total",null,"NA",null,"NA",null,{"$f":"SUM(I159:I160)","v":0},null,"NA",null,{"$f":"SUM(M159:M160)","v":0}]
[]
[]
[null,"Pollutants Produced Mowing (Single Mower)"]
[null,null,null,null,"hp-hr",null,"g/hp-hr",null,"Pollutant (grams)",null,"lbs/g",null,"Pollutants (lbs)"]
[null,null,"HC",null,{"$f":"$G$153","v":0},"x",{"$f":"VLOOKUP($E$140,Factors!$G$56:$K$58,MATCH(Calculations!$C167,Factors!$G$54:$K$54,0),0)","v":0.27},"=",{"$f":"G167*E167","v":0},"x",{"$f":"Factors!$I$133","v":2.2000000000000001E-3},"=",{"$f":"K167*I167","v":0}]
[null,null,"CO",null,{"$f":"$G$153","v":0},"x",{"$f":"VLOOKUP($E$140,Factors!$G$56:$K$58,MATCH(Calculations!$C168,Factors!$G$54:$K$54,0),0)","v":11.94},"=",{"$f":"G168*E168","v":0},"x",{"$f":"Factors!$I$133","v":2.2000000000000001E-3},"=",{"$f":"K168*I168","v":0}]
[null,null,"NOx",null,0,"x",{"$f":"VLOOKUP($E$140,Factors!$G$56:$K$58,MATCH(Calculations!$C169,Factors!$G$54:$K$54,0),0)","v":0.69},"=",0,"x",{"$f":"Factors!$I$133","v":2.2000000000000001E-3},"=",0]
[null,null,"PM",null,0,"x",{"$f":"VLOOKUP($E$140,Factors!$G$56:$K$58,MATCH(Calculations!$C170,Factors!$G$54:$K$54,0),0)","v":7.7},"=",0,"x",{"$f":"Factors!$I$133","v":2.2000000000000001E-3},"=",0]
[]
[null,"Calculations for a Multiple Mower Planned Scenario"]
[]
[]
[null,"Multiple Mower Specifications"]
[null,null,"Name",null,"Deck Size (in)",null,"Horsepower (hp)",null,"Fuel Type",null,"Fuel Cost ($/gallon)",null,"Mow speed (mph)",null,"% of total acres"]
[null,"1)",{"$f":"IFERROR(IF($B$125=\"a\",'Mowing Scenario'!C114,C57),0)","v":""},null,{"$f":"IFERROR(IF($B$125=\"a\",'Mowing Scenario'!F114,E57),0)","v":46},null,{"$f":"IFERROR(IF($B$125=\"a\",'Mowing Scenario'!H114,G57),0)","v":20},null,{"$f":"IFERROR(IF($B$125=\"a\",'Mowing Scenario'!J114,I57),0)","v":"Gasoline"},null,{"$f":"IFERROR(IF($B$125=\"a\",'Mowing Scenario'!L114,K57),0)","v":3.7},null,{"$f":"IFERROR(IF($B$125=\"a\",'Mowing Scenario'!N114,M57),0)","v":5},null,{"$f":"IFERROR(IF($B$125=\"a\",'Mowing Scenario'!P114,O57),0)","v":100}]
[null,"2)",{"$f":"IFERROR(IF($B$125=\"a\",'Mowing Scenario'!C115,C58),0)","v":""},null,{"$f":"IFERROR(IF($B$125=\"a\",'Mowing Scenario'!F115,E58),0)","v":""},null,{"$f":"IFERROR(IF($B$125=\"a\",'Mowing Scenario'!H115,G58),0)","v":""},null,{"$f":"IFERROR(IF($B$125=\"a\",'Mowing Scenario'!J115,I58),0)","v":""},null,{"$f":"IFERROR(IF($B$125=\"a\",'Mowing Scenario'!L115,K58),0)","v":""},null,{"$f":"IFERROR(IF($B$125=\"a\",'Mowing Scenario'!N115,M58),0)","v":""},null,{"$f":"IFERROR(IF($B$125=\"a\",'Mowing Scenario'!P115,O58),0)","v":""}]
[null,"3)",{"$f":"IFERROR(IF($B$125=\"a\",'Mowing Scenario'!C116,C59),0)","v":""},null,{"$f":"IFERROR(IF($B$125=\"a\",'Mowing Scenario'!F116,E59),0)","v":""},null,{"$f":"IFERROR(IF($B$125=\"a\",'Mowing Scenario'!H116,G59),0)","v":""},null,{"$f":"IFERROR(IF($B$125=\"a\",'Mowing Scenario'!J116,I59),0)","v":""},null,{"$f":"IFERROR(IF($B$125=\"a\",'Mowing Scenario'!L116,K59),0)","v":""},null,{"$f":"IFERROR(IF($B$125=\"a\",'Mowing Scenario'!N116,M59),0)","v":""},null,{"$f":"IFERROR(IF($B$125=\"a\",'Mowing Scenario'!P116,O59),0)","v":""}]
[null,"4)",{"$f":"IFERROR(IF($B$125=\"a\",'Mowing Scenario'!C117,C60),0)","v":""},null,{"$f":"IFERROR(IF($B$125=\"a\",'Mowing Scenario'!F117,E60),0)","v":""},null,{"$f":"IFERROR(IF($B$125=\"a\",'Mowing Scenario'!H117,G60),0)","v":""},null,{"$f":"IFERROR(IF($B$125=\"a\",'Mowing Scenario'!J117,I60),0)","v":""},null,{"$f":"IFERROR(IF($B$125=\"a\",'Mowing Scenario'!L117,K60),0)","v":""},null,{"$f":"IFERROR(IF($B$125=\"a\",'Mowing Scenario'!N117,M60),0)","v":""},null,{"$f":"IFERROR(IF($B$125=\"a\",'Mowing Scenario'!P117,O60),0)","v":""}]
[null,"5)",{"$f":"IFERROR(IF($B$125=\"a\",'Mowing Scenario'!C118,C61),0)","v":""},null,{"$f":"IFERROR(IF($B$125=\"a\",'Mowing Scenario'!F118,E61),0)","v":""},null,{"$f":"IFERROR(IF($B$125=\"a\",'Mowing Scenario'!H118,G61),0)","v":""},null,{"$f":"IFERROR(IF($B$125=\"a\",'Mowing Scenario'!J118,I61),0)","v":""},null,{"$f":"IFERROR(IF($B$125=\"a\",'Mowing Scenario'!L118,K61),0)","v":""},null,{"$f":"IFERROR(IF($B$125=\"a\",'Mowing Scenario'!N118,M61),0)","v":""},null,{"$f":"IFERROR(IF($B$125=\"a\",'Mowing Scenario'!P118,O61),0)","v":""}]
[]
[]
[null,"Fuel Consumed Mowing and Fuel Costs (Multiple Mowers)"]
[null,null,"Name",null,"Mow Rate Coefficient",null,"Swath overlap",null,"Deck Size (in)",null,"Mow speed (mph)",null,"Mow time (hours/acre)",null,"% of total acres",null,"Acres",null,"Hours/Mow",null,"Mow Occurences",null,"Total Hours",null,"Horsepower",null,"hp-hr",null,"BSCF (Btu/hp-hr)",null,"Energy (Btu)",null,"Btu/gallon",null,"Gallons",null,"Fuel Cost ($/gallon)",null,"Fuel Costs"]
[null,"1)",{"$f":"C177","v":""},null,{"$f":"Factors!$B$64","v":108.9},"/",{"$f":"Factors!$D$64","v":0.9},"x",{"$f":"E177","v":46},"x",{"$f":"M177","v":5},"=",{"$f":"IFERROR(E186/(G186*I186*K186),0)","v":0.5260869565217392},"x",{"$f":"IFERROR(O177/100,0)","v":1},"x",{"$f":"IFERROR('Mowing Scenario'!$F$78,0)","v":0},"=",{"$f":"Q186*O186*M186","v":0},"x",{"$f":"IFERROR($E$131,0)","v":26},"=",{"$f":"U186*S186","v":0},"x",{"$f":"G177","v":20},"=",{"$f":"IFERROR(Y186*W186,0)","v":0},"x",{"$f":"IFERROR(VLOOKUP(I177,Factors!$B$71:$C$73,2,0),0)","v":9039},"=",{"$f":"AC186*AA186","v":0},"x",{"$f":"IFERROR(VLOOKUP(I177,Factors!$B$71:$E$73,4,0),0)","v":125000},"=",{"$f":"IFERROR(AE186/AG186,0)","v":0},"x",{"$f":"K177","v":3.7},"=",{"$f":"IFERROR(AK186*AI186,0)","v":0}]
[null,"2)",{"$f":"C178","v":""},null,{"$f":"Factors!$B$64","v":108.9},"/",{"$f":"Factors!$D$64","v":0.9},"x",{"$f":"E178","v":""},"x",{"$f":"M178","v":""},"=",{"$f":"IFERROR(E187/(G187*I187*K187),0)","v":0},"x",{"$f":"IFERROR(O178/100,0)","v":0},"x",{"$f":"IFERROR('Mowing Scenario'!$F$78,0)","v":0},"=",{"$f":"Q187*O187*M187","v":0},"x",{"$f":"IFERROR($E$131,0)","v":26},"=",{"$f":"U187*S187","v":0},"x",{"$f":"G178","v":""},"=",{"$f":"IFERROR(Y187*W187,0)","v":0},"x",{"$f":"IFERROR(VLOOKUP(I178,Factors!$B$71:$C$73,2,0),0)","v":0},"=",{"$f":"AC187*AA187","v":0},"x",{"$f":"IFERROR(VLOOKUP(I178,Factors!$B$71:$E$73,4,0),0)","v":0},"=",{"$f":"IFERROR(AE187/AG187,0)","v":0},"x",{"$f":"K178","v":""},"=",{"$f":"IFERROR(AK187*AI187,0)","v":0}]
[null,"3)",{"$f":"C179","v":""},null,{"$f":"Factors!$B$64","v":108.9},"/",{"$f":"Factors!$D$64","v":0.9},"x",{"$f":"E179","v":""},"x",{"$f":"M179","v":""},"=",0,"x",0,"x",{"$f":"IFERROR('Mowing Scenario'!$F$78,0)","v":0},"=",0,"x",26,"=",0,"x",{"$f":"G179","v":""},"=",0,"x",{"$f":"IFERROR(VLOOKUP(I179,Factors!$B$71:$C$73,2,0),0)","v":0},"=",{"$f":"AC188*AA188","v":0},"x",{"$f":"IFERROR(VLOOKUP(I179,Factors!$B$71:$E$73,4,0),0)","v":0},"=",0,"x",{"$f":"K179","v":""},"=",0]
[null,"4)",{"$f":"C180","v":""},null,{"$f":"Factors!$B$64","v":108.9},"/",{"$f":"Factors!$D$64","v":0.9},"x",{"$f":"E180","v":""},"x",{"$f":"M180","v":""},"=",0,"x",0,"x",{"$f":"IFERROR('Mowing Scenario'!$F$78,0)","v":0},"=",0,"x",26,"=",0,"x",{"$f":"G180","v":""},"=",0,"x",{"$f":"IFERROR(VLOOKUP(I180,Factors!$B$71:$C$73,2,0),0)","v":0},"=",{"$f":"AC189*AA189","v":0},"x",{"$f":"IFERROR(VLOOKUP(I180,Factors!$B$71:$E$73,4,0),0)","v":0},"=",0,"x",{"$f":"K180","v":""},"=",0]
[null,"5)",{"$f":"C181","v":""},null,{"$f":"Factors!$B$64","v":108.9},"/",{"$f":"Factors!$D$64","v":0.9},"x",{"$f":"E181","v":""},"x",{"$f":"M181","v":""},"=",0,"x",0,"x",{"$f":"IFERROR('Mowing Scenario'!$F$78,0)","v":0},"=",0,"x",26,"=",0,"x",{"$f":"G181","v":""},"=",0,"x",{"$f":"IFERROR(VLOOKUP(I181,Factors!$B$71:$C$73,2,0),0)","v":0},"=",{"$f":"AC190*AA190","v":0},"x",{"$f":"IFERROR(VLOOKUP(I181,Factors!$B$71:$E$73,4,0),0)","v":0},"=",0,"x",{"$f":"K181","v":""},"=",0]
[]
[null,null,{"$f":"IF($B$125=\"a\",'Mowing Scenario'!N121,C186)","v":""},null,{"$f":"Factors!$B$64","v":108.9},"/",{"$f":"Factors!$D$64","v":0.9},"x",{"$f":"IFERROR(VLOOKUP($C$192,$C$186:$AM$190,MATCH(I185,$C$185:$AM$185,0),0),0)","v":46},"x",{"$f":"IFERROR(VLOOKUP($C$192,$C$186:$AM$190,MATCH(K185,$C$185:$AM$185,0),0),0)","v":5},"=",{"$f":"IFERROR(E192/(G192*I192*K192),0)","v":0.5260869565217392},"x",1,"x",{"$f":"IFERROR('Mowing Scenario'!D12,0)","v":0},"=",{"$f":"Q192*O192*M192","v":0},"x",{"$f":"IFERROR('Mowing Scenario'!L80,0)","v":""},"=",{"$f":"IFERROR(U192*S192,0)","v":0},"x",{"$f":"IFERROR(VLOOKUP($C$192,$C$186:$AM$190,MATCH(Y185,$C$185:$AM$185,0),0),0)","v":20},"=",{"$f":"IFERROR(Y192*W192,0)","v":0},"x",{"$f":"IFERROR(VLOOKUP($C$192,$C$186:$AM$190,MATCH(AC185,$C$185:$AM$185,0),0),0)","v":9039},"=",{"$f":"AC192*AA192","v":0},"x",{"$f":"IFERROR(VLOOKUP($C$192,$C$186:$AM$190,MATCH(AG185,$C$185:$AM$185,0),0),0)","v":125000},"=",{"$f":"IFERROR(AE192/AG192,0)","v":0},"x",{"$f":"IFERROR(VLOOKUP($C$192,$C$186:$AM$190,MATCH(AK185,$C$185:$AM$185,0),0),0)","v":3.7},"=",{"$f":"IFERROR(AK192*AI192,0)","v":0}]
[]
[null,null,"Total",null,null,null,null,null,null,null,null,null,null,null,null,null,null,null,{"$f":"IFERROR(SUM(S186:S190),0)","v":0},null,null,null,{"$f":"SUM(W186:W190,W192)","v":0},null,null,null,null,null,null,null,{"$f":"IFERROR(SUM(AE186:AE190,AE192),0)","v":0},null,null,null,{"$f":"IFERROR(SUM(AI186:AI190,AI192),0)","v":0},null,null,null,{"$f":"IFERROR(SUM(AM186:AM190,AM192),0)","v":0}]
[]
[null,"Fuel Consumed in Gasoline Gallon Equivalents (Multiple Mowers)"]
[null,null,null,null,"Gallons",null,"GGE/Gallon",null,"Fuel Consumption (GGE)"]
[null,null,{"$f":"C186","v":""},null,{"$f":"IF($C198=$C$192,$AI$192,0)+VLOOKUP($C198,$C$186:$AM$190,MATCH($E$197,$C$185:$AM$185,0),0)","v":0},"x",{"$f":"IFERROR(VLOOKUP(I177,Factors!$B$32:$E$41,4,0),0)","v":1},"=",{"$f":"IFERROR(G198*E198,E198)","v":0}]
[null,null,{"$f":"C187","v":""},null,{"$f":"IF($C199=$C$192,$AI$192,0)+VLOOKUP($C199,$C$186:$AM$190,MATCH($E$197,$C$185:$AM$185,0),0)","v":0},"x",{"$f":"IFERROR(VLOOKUP(I178,Factors!$B$32:$E$41,4,0),0)","v":0},"=",{"$f":"IFERROR(G199*E199,E199)","v":0}]
[null,null,{"$f":"C188","v":""},null,{"$f":"IF($C200=$C$192,$AI$192,0)+VLOOKUP($C200,$C$186:$AM$190,MATCH($E$197,$C$185:$AM$185,0),0)","v":0},"x",{"$f":"IFERROR(VLOOKUP(I179,Factors!$B$32:$E$41,4,0),0)","v":0},"=",0]
[null,null,{"$f":"C189","v":""},null,{"$f":"IF($C201=$C$192,$AI$192,0)+VLOOKUP($C201,$C$186:$AM$190,MATCH($E$197,$C$185:$AM$185,0),0)","v":0},"x",{"$f":"IFERROR(VLOOKUP(I180,Factors!$B$32:$E$41,4,0),0)","v":0},"=",0]
[null,null,{"$f":"C190","v":""},null,{"$f":"IF($C202=$C$192,$AI$192,0)+VLOOKUP($C202,$C$186:$AM$190,MATCH($E$197,$C$185:$AM$185,0),0)","v":0},"x",{"$f":"IFERROR(VLOOKUP(I181,Factors!$B$32:$E$41,4,0),0)","v":0},"=",0]
[]
[null,null,"Total",null,null,null,null,null,{"$f":"SUM(I198:I202)","v":0}]
[]
[]
[null,"GHGs and Pollutants Produced Mowing (Multiple Mowers by Mower)"]
[]
[null,null,{"$f":"C186","v":""},null,"Energy (Btu)",null,null,null,null,null,null,null,null,null,null,null,{"$f":"C178","v":""},null,"Energy (Btu)",null,null,null,null,null,null,null,null,null,null,null,{"$f":"C179","v":""},null,"Energy (Btu)",null,null,null,null,null,null,null,null,null,null,null,{"$f":"C180","v":""},null,"Energy (Btu)",null,null,null,null,null,null,null,null,null,null,null,{"$f":"C190","v":""},null,"Energy (Btu)"]
[null,null,null,null,"MMBtu",null,"kgCO2e/MMBtu",null,"GHGs (kgCO2e)",null,"lbs/kg",null,"GHGs (lbsCO2e)",null,null,null,null,null,"MMBtu",null,"kgCO2e/MMBtu",null,"GHGs (kgCO2e)",null,"lbs/kg",null,"GHGs (lbsCO2e)",null,null,null,null,null,"MMBtu",null,"kgCO2e/MMBtu",null,"GHGs (kgCO2e)",null,"lbs/kg",null,"GHGs (lbsCO2e)",null,null,null,null,null,"MMBtu",null,"kgCO2e/MMBtu",null,"GHGs (kgCO2e)",null,"lbs/kg",null,"GHGs (lbsCO2e)",null,null,null,null,null,"MMBtu",null,"kgCO2e/MMBtu",null,"GHGs (kgCO2e)",null,"lbs/kg",null,"GHGs (lbsCO2e)"]
[null,null,"Upstream CO2",null,{"$f":"IF($C$209=$C$192,$AE$192/Factors!$K$112,0)+VLOOKUP($C$209,$C$186:$AM$190,MATCH($E$209,$C$185:$AM$185,0),0)/Factors!$K$112","v":0},"x",{"$f":"IFERROR(VLOOKUP($I$177,Factors!$B$56:$D$58,2,0),0)","v":0},"=",{"$f":"G211*E211","v":0},"x",{"$f":"Factors!$I$134","v":2.2046000000000001},"=",{"$f":"K211*I211","v":0},null,null,null,"Upstream CO2",null,{"$f":"IF($Q$209=$C$192,$AE$192/Factors!$K$112,0)+VLOOKUP($Q$209,$C$186:$AM$190,MATCH($E$209,$C$185:$AM$185,0),0)/Factors!$K$112","v":0},"x",{"$f":"IFERROR(VLOOKUP($I$178,Factors!$B$56:$D$58,2,0),0)","v":0},"=",{"$f":"U211*S211","v":0},"x",{"$f":"Factors!$I$134","v":2.2046000000000001},"=",{"$f":"Y211*W211","v":0},null,null,null,"Upstream CO2",null,{"$f":"IF($AE$209=$C$192,$AE$192/Factors!$K$112,0)+VLOOKUP($AE$209,$C$186:$AM$190,MATCH($E$209,$C$185:$AM$185,0),0)/Factors!$K$112","v":0},"x",{"$f":"IFERROR(VLOOKUP($I$179,Factors!$B$56:$D$58,2,0),0)","v":0},"=",{"$f":"AI211*AG211","v":0},"x",{"$f":"Factors!$I$134","v":2.2046000000000001},"=",{"$f":"AM211*AK211","v":0},null,null,null,"Upstream CO2",null,{"$f":"IF($AS$209=$C$192,$AE$192/Factors!$K$112,0)+VLOOKUP($AS$209,$C$186:$AM$190,MATCH($E$209,$C$185:$AM$185,0),0)/Factors!$K$112","v":0},"x",{"$f":"IFERROR(VLOOKUP($I$180,Factors!$B$56:$D$58,2,0),0)","v":0},"=",{"$f":"AW211*AU211","v":0},"x",{"$f":"Factors!$I$134","v":2.2046000000000001},"=",{"$f":"BA211*AY211","v":0},null,null,null,"Upstream CO2",null,{"$f":"IF($BG$209=$C$192,$AE$192/Factors!$K$112,0)+VLOOKUP($BG$209,$C$186:$AM$190,MATCH($E$209,$C$185:$AM$185,0),0)/Factors!$K$112","v":0},"x",{"$f":"IFERROR(VLOOKUP($I$181,Factors!$B$56:$D$58,2,0),0)","v":0},"=",{"$f":"BK211*BI211","v":0},"x",{"$f":"Factors!$I$134","v":2.2046000000000001},"=",{"$f":"BO211*BM211","v":0}]
[null,null,"CO2e",null,{"$f":"IF($C$209=$C$192,$AE$192/Factors!$K$112,0)+VLOOKUP($C$209,$C$186:$AM$190,MATCH($E$209,$C$185:$AM$185,0),0)/Factors!$K$112","v":0},"x",{"$f":"IFERROR(VLOOKUP($I$177,Factors!$B$56:$D$58,3,0),0)","v":71.418199999999999},"=",{"$f":"G212*E212","v":0},"x",{"$f":"Factors!$I$134","v":2.2046000000000001},"=",{"$f":"K212*I212","v":0},null,null,null,"CO2e",null,{"$f":"IF($Q$209=$C$192,$AE$192/Factors!$K$112,0)+VLOOKUP($Q$209,$C$186:$AM$190,MATCH($E$209,$C$185:$AM$185,0),0)/Factors!$K$112","v":0},"x",{"$f":"IFERROR(VLOOKUP($I$178,Factors!$B$56:$D$58,3,0),0)","v":0},"=",{"$f":"U212*S212","v":0},"x",{"$f":"Factors!$I$134","v":2.2046000000000001},"=",{"$f":"Y212*W212","v":0},null,null,null,"CO2e",null,{"$f":"IF($AE$209=$C$192,$AE$192/Factors!$K$112,0)+VLOOKUP($AE$209,$C$186:$AM$190,MATCH($E$209,$C$185:$AM$185,0),0)/Factors!$K$112","v":0},"x",{"$f":"IFERROR(VLOOKUP($I$179,Factors!$B$56:$D$58,3,0),0)","v":0},"=",{"$f":"AI212*AG212","v":0},"x",{"$f":"Factors!$I$134","v":2.2046000000000001},"=",{"$f":"AM212*AK212","v":0},null,null,null,"CO2e",null,{"$f":"IF($AS$209=$C$192,$AE$192/Factors!$K$112,0)+VLOOKUP($AS$209,$C$186:$AM$190,MATCH($E$209,$C$185:$AM$185,0),0)/Factors!$K$112","v":0},"x",{"$f":"IFERROR(VLOOKUP($I$180,Factors!$B$56:$D$58,3,0),0)","v":0},"=",{"$f":"AW212*AU212","v":0},"x",{"$f":"Factors!$I$134","v":2.2046000000000001},"=",{"$f":"BA212*AY212","v":0},null,null,null,"CO2e",null,{"$f":"IF($BG$209=$C$192,$AE$192/Factors!$K$112,0)+VLOOKUP($BG$209,$C$186:$AM$190,MATCH($E$209,$C$185:$AM$185,0),0)/Factors!$K$112","v":0},"x",{"$f":"IFERROR(VLOOKUP($I$181,Factors!$B$56:$D$58,3,0),0)","v":0},"=",{"$f":"BK212*BI212","v":0},"x",{"$f":"Factors!$I$134","v":2.2046000000000001},"=",{"$f":"BO212*BM212","v":0}]
[]
[null,null,null,null,"hp-hr",null,"g/hp-hr",null,"Pollutant (grams)",null,"lbs/g",null,"Pollutants (lbs)",null,null,null,null,null,"hp-hr",null,"g/hp-hr",null,"Pollutant (grams)",null,"lbs/g",null,"Pollutants (lbs)",null,null,null,null,null,"hp-hr",null,"g/hp-hr",null,"Pollutant (grams)",null,"lbs/g",null,"Pollutants (lbs)",null,null,null,null,null,"hp-hr",null,"g/hp-hr",null,"Pollutant (grams)",null,"lbs/g",null,"Pollutants (lbs)",null,null,null,null,null,"hp-hr",null,"g/hp-hr",null,"Pollutant (grams)",null,"lbs/g",null,"Pollutants (lbs)"]
[null,null,"HC",null,{"$f":"IF($C$209=$C$192,$AA$192,0)+VLOOKUP($C$209,$C$186:$AM$190,MATCH($E$214,$C$185:$AM$185,0),0)","v":0},"x",{"$f":"IFERROR(VLOOKUP($I$177,Factors!$G$56:$K$58,2,0),0)","v":0.27},"=",{"$f":"G215*E215","v":0},"x",{"$f":"Factors!$I$133","v":2.2000000000000001E-3},"=",{"$f":"K215*I215","v":0},null,null,null,"HC",null,{"$f":"IF($Q$209=$C$192,$AA$192,0)+VLOOKUP($Q$209,$C$186:$AM$190,MATCH($E$214,$C$185:$AM$185,0),0)","v":0},"x",{"$f":"IFERROR(VLOOKUP($I$178,Factors!$G$56:$K$58,2,0),0)","v":0},"=",{"$f":"U215*S215","v":0},"x",{"$f":"Factors!$I$133","v":2.2000000000000001E-3},"=",{"$f":"Y215*W215","v":0},null,null,null,"HC",null,{"$f":"IF($AE$209=$C$192,$AA$192,0)+VLOOKUP($AE$209,$C$186:$AM$190,MATCH($E$214,$C$185:$AM$185,0),0)","v":0},"x",{"$f":"IFERROR(VLOOKUP($I$179,Factors!$G$56:$K$58,2,0),0)","v":0},"=",{"$f":"AI215*AG215","v":0},"x",{"$f":"Factors!$I$133","v":2.2000000000000001E-3},"=",{"$f":"AM215*AK215","v":0},null,null,null,"HC",null,{"$f":"IF($AS$209=$C$192,$AA$192,0)+VLOOKUP($AS$209,$C$186:$AM$190,MATCH($E$214,$C$185:$AM$185,0),0)","v":0},"x",{"$f":"IFERROR(VLOOKUP($I$180,Factors!$G$56:$K$58,2,0),0)","v":0},"=",{"$f":"AW215*AU215","v":0},"x",{"$f":"Factors!$I$133","v":2.2000000000000001E-3},"=",{"$f":"BA215*AY215","v":0},null,null,null,"HC",null,{"$f":"IF($BG$209=$C$192,$AA$192,0)+VLOOKUP($BG$209,$C$186:$AM$190,MATCH($E$214,$C$185:$AM$185,0),0)","v":0},"x",{"$f":"IFERROR(VLOOKUP($I$181,Factors!$G$56:$K$58,2,0),0)","v":0},"=",{"$f":"BK215*BI215","v":0},"x",{"$f":"Factors!$I$133","v":2.2000000000000001E-3},"=",{"$f":"BO215*BM215","v":0}]
[null,null,"CO",null,{"$f":"IF($C$209=$C$192,$AA$192,0)+VLOOKUP($C$209,$C$186:$AM$190,MATCH($E$214,$C$185:$AM$185,0),0)","v":0},"x",{"$f":"IFERROR(VLOOKUP($I$177,Factors!$G$56:$K$58,3,0),0)","v":11.94},"=",{"$f":"G216*E216","v":0},"x",{"$f":"Factors!$I$133","v":2.2000000000000001E-3},"=",0,null,null,null,"CO",null,{"$f":"IF($Q$209=$C$192,$AA$192,0)+VLOOKUP($Q$209,$C$186:$AM$190,MATCH($E$214,$C$185:$AM$185,0),0)","v":0},"x",{"$f":"IFERROR(VLOOKUP($I$178,Factors!$G$56:$K$58,3,0),0)","v":0},"=",{"$f":"U216*S216","v":0},"x",{"$f":"Factors!$I$133","v":2.2000000000000001E-3},"=",{"$f":"Y216*W216","v":0},null,null,null,"CO",null,{"$f":"IF($AE$209=$C$192,$AA$192,0)+VLOOKUP($AE$209,$C$186:$AM$190,MATCH($E$214,$C$185:$AM$185,0),0)","v":0},"x",{"$f":"IFERROR(VLOOKUP($I$179,Factors!$G$56:$K$58,3,0),0)","v":0},"=",{"$f":"AI216*AG216","v":0},"x",{"$f":"Factors!$I$133","v":2.2000000000000001E-3},"=",0,null,null,null,"CO",null,{"$f":"IF($AS$209=$C$192,$AA$192,0)+VLOOKUP($AS$209,$C$186:$AM$190,MATCH($E$214,$C$185:$AM$185,0),0)","v":0},"x",{"$f":"IFERROR(VLOOKUP($I$180,Factors!$G$56:$K$58,3,0),0)","v":0},"=",{"$f":"AW216*AU216","v":0},"x",{"$f":"Factors!$I$133","v":2.2000000000000001E-3},"=",0,null,null,null,"CO",null,{"$f":"IF($BG$209=$C$192,$AA$192,0)+VLOOKUP($BG$209,$C$186:$AM$190,MATCH($E$214,$C$185:$AM$185,0),0)","v":0},"x",{"$f":"IFERROR(VLOOKUP($I$181,Factors!$G$56:$K$58,3,0),0)","v":0},"=",{"$f":"BK216*BI216","v":0},"x",{"$f":"Factors!$I$133","v":2.2000000000000001E-3},"=",0]
[null,null,"NOx",null,{"$f":"IF($C$209=$C$192,$AA$192,0)+VLOOKUP($C$209,$C$186:$AM$190,MATCH($E$214,$C$185:$AM$185,0),0)","v":0},"x",{"$f":"IFERROR(VLOOKUP($I$177,Factors!$G$56:$K$58,4,0),0)","v":0.69},"=",0,"x",{"$f":"Factors!$I$133","v":2.2000000000000001E-3},"=",0,null,null,null,"NOx",null,{"$f":"IF($Q$209=$C$192,$AA$192,0)+VLOOKUP($Q$209,$C$186:$AM$190,MATCH($E$214,$C$185:$AM$185,0),0)","v":0},"x",{"$f":"IFERROR(VLOOKUP($I$178,Factors!$G$56:$K$58,4,0),0)","v":0},"=",{"$f":"U217*S217","v":0},"x",{"$f":"Factors!$I$133","v":2.2000000000000001E-3},"=",{"$f":"Y217*W217","v":0},null,null,null,"NOx",null,{"$f":"IF($AE$209=$C$192,$AA$192,0)+VLOOKUP($AE$209,$C$186:$AM$190,MATCH($E$214,$C$185:$AM$185,0),0)","v":0},"x",{"$f":"IFERROR(VLOOKUP($I$179,Factors!$G$56:$K$58,4,0),0)","v":0},"=",0,"x",{"$f":"Factors!$I$133","v":2.2000000000000001E-3},"=",0,null,null,null,"NOx",null,{"$f":"IF($AS$209=$C$192,$AA$192,0)+VLOOKUP($AS$209,$C$186:$AM$190,MATCH($E$214,$C$185:$AM$185,0),0)","v":0},"x",{"$f":"IFERROR(VLOOKUP($I$180,Factors!$G$56:$K$58,4,0),0)","v":0},"=",0,"x",{"$f":"Factors!$I$133","v":2.2000000000000001E-3},"=",0,null,null,null,"NOx",null,{"$f":"IF($BG$209=$C$192,$AA$192,0)+VLOOKUP($BG$209,$C$186:$AM$190,MATCH($E$214,$C$185:$AM$185,0),0)","v":0},"x",{"$f":"IFERROR(VLOOKUP($I$181,Factors!$G$56:$K$58,4,0),0)","v":0},"=",0,"x",{"$f":"Factors!$I$133","v":2.2000000000000001E-3},"=",0]
[null,null,"PM",null,{"$f":"IF($C$209=$C$192,$AA$192,0)+VLOOKUP($C$209,$C$186:$AM$190,MATCH($E$214,$C$185:$AM$185,0),0)","v":0},"x",{"$f":"IFERROR(VLOOKUP($I$177,Factors!$G$56:$K$58,5,0),0)","v":7.7},"=",0,"x",{"$f":"Factors!$I$133","v":2.2000000000000001E-3},"=",0,null,null,null,"PM",null,{"$f":"IF($Q$209=$C$192,$AA$192,0)+VLOOKUP($Q$209,$C$186:$AM$190,MATCH($E$214,$C$185:$AM$185,0),0)","v":0},"x",{"$f":"IFERROR(VLOOKUP($I$178,Factors!$G$56:$K$58,5,0),0)","v":0},"=",{"$f":"U218*S218","v":0},"x",{"$f":"Factors!$I$133","v":2.2000000000000001E-3},"=",{"$f":"Y218*W218","v":0},null,null,null,"PM",null,{"$f":"IF($AE$209=$C$192,$AA$192,0)+VLOOKUP($AE$209,$C$186:$AM$190,MATCH($E$214,$C$185:$AM$185,0),0)","v":0},"x",{"$f":"IFERROR(VLOOKUP($I$179,Factors!$G$56:$K$58,5,0),0)","v":0},"=",0,"x",{"$f":"Factors!$I$133","v":2.2000000000000001E-3},"=",0,null,null,null,"PM",null,{"$f":"IF($AS$209=$C$192,$AA$192,0)+VLOOKUP($AS$209,$C$186:$AM$190,MATCH($E$214,$C$185:$AM$185,0),0)","v":0},"x",{"$f":"IFERROR(VLOOKUP($I$180,Factors!$G$56:$K$58,5,0),0)","v":0},"=",0,"x",{"$f":"Factors!$I$133","v":2.2000000000000001E-3},"=",0,null,null,null,"PM",null,{"$f":"IF($BG$209=$C$192,$AA$192,0)+VLOOKUP($BG$209,$C$186:$AM$190,MATCH($E$214,$C$185:$AM$185,0),0)","v":0},"x",{"$f":"IFERROR(VLOOKUP($I$181,Factors!$G$56:$K$58,5,0),0)","v":0},"=",0,"x",{"$f":"Factors!$I$133","v":2.2000000000000001E-3},"=",0]
[]
[]
[null,null,"Total",null,"GHGs (lbsCO2e)"]
[null,null,"Upstream CO2",null,{"$f":"SUM(M211,AA211,AO211,BC211,BQ211)","v":0}]
[null,null,"CO2e",null,{"$f":"SUM(M212,AA212,AO212,BC212,BQ212)","v":0}]
[]
[null,null,"Total",null,{"$f":"SUM(E222:E223)","v":0}]
[]
[null,null,null,null,"Pollutants (lbs)"]
[null,null,"HC",null,{"$f":"SUM(M215,AA215,AO215,BC215,BQ215)","v":0}]
[null,null,"CO",null,{"$f":"SUM(M216,AA216,AO216,BC216,BQ216)","v":0}]
[null,null,"NOx",null,{"$f":"SUM(M217,AA217,AO217,BC217,BQ217)","v":0}]
[null,null,"PM",null,{"$f":"SUM(M218,AA218,AO218,BC218,BQ218)","v":0}]
[]
[null,"Calculations for a Planned Irrigation Scenario"]
[]
[null,null,null,null,"Irrigated Acres",null,"Irrigation Rate (inches per application)",null,"Irrigation Cycle Amount (gallons/ inch/ acre)",null,"Irrigation Volume (gallons/cycle)",null,"Irrigation Cycles per Season",null,"Seasonal Irrigation Volume (gallons)"]
[null,"1)","Mowed Area",null,{"$f":"IFERROR(IF(B126=\"a\",'Mowing Scenario'!N129,C114),0)","v":""},"x",{"$f":"IFERROR(IF(B126=\"a\",'Mowing Scenario'!L133,E114),0)","v":1},"x",{"$f":"Factors!$H$70","v":27000},"=",{"$f":"IFERROR(I236*G236*E236,0)","v":0},"x",{"$f":"IFERROR(IF(B126=\"a\",'Mowing Scenario'!L131,K114),0)","v":""},"=",{"$f":"IFERROR(M236*K236,0)","v":0}]
[null,"2)","Unmowed Area",null,{"$f":"IFERROR('Mowing Scenario'!N138,0)","v":0},"x",{"$f":"IFERROR('Mowing Scenario'!L142,0)","v":1},"x",{"$f":"Factors!$H$70","v":27000},"=",{"$f":"IFERROR(I237*G237*E237,0)","v":0},"x",{"$f":"IFERROR('Mowing Scenario'!L140,0)","v":""},"=",{"$f":"IFERROR(M237*K237,0)","v":0}]
[]
[null,null,"Total",null,{"$f":"SUM(E236:E237)","v":0},null,null,null,null,null,{"$f":"SUM(K236:K237)","v":0},null,null,null,{"$f":"SUM(O236:O237)","v":0}]

{"sheet":"Factors","index":4,"n_rows":198,"n_cols":13,"rows_kept":198,"cut":false,"hidden":false,"merged":[[70,6,72,10]]}
[]
[null,"Conversion and Emission Factors"]
[]
[]
[]
[null,"IPCC SAR Global Warming Potential (GWPs)"]
[null,"Gas","GWP"]
[null,"CO2",1]
[null,"CH4",21]
[null,"N2O",310]
[null,"HFC-23",11700]
[null,"HFC-32",650]
[null,"HFC-125",2800]
[null,"HFC-134a",1300]
[null,"HFC-143a",3800]
[null,"HFC-152a",140]
[null,"HFC-227ea",2900]
[null,"HFC-236fa",6300]
[null,"HFC-4310mee",1300]
[null,"CF4",6500]
[null,"C2F6",9200]
[null,"C4F10",7000]
[null,"C6F14",7400]
[null,"SF6",23900]
[null,"Source: U.S. Inventory of Greenhouse Gas Emissions and Sinks 1990-2005 (Table ES-1), US EPA"]
[null,"Available online: ","http://www.epa.gov/climatechange/emissions/usgginv_archive.html"]
[]
[null,"CO2/C",3.6666666669999999]
[]
[null,"Gasoline Gallon Equivalents (GGE)"]
[null,"Fuel Type","Description","Natural Units","GGE Conversion","GGE UOM"]
[null,"Gasoline","Gasoline","Gallons",1,"GGE/Gal"]
[null,"Diesel","Diesel","Gallons",1.147,"GGE/Gal"]
[null,"Propane","Propane","Gallons",0.74,"GGE/Gal"]
[null,"LNG","LNG","Gallons at 14.7psi and -234 degrees F",0.66,"GGE/Gal"]
[null,"CNG (2400 psi)","CNG at 2400 psi","Gallons at 2400 psi",0.18,"GGE/Gal"]
[null,"CNG (3000 psi)","CNG at 3000 psi","Gallons at 3000 psi",0.22500000000000001,"GGE/Gal"]
[null,"CNG (3600 psi)","CNG at 3600 psi","Gallons at 3600 psi",0.27,"GGE/Gal"]
[null,"Biodiesel - B20","Biodiesel 20","Gallons",1.1259999999999999,"GGE/Gal"]
[null,"Biodiesel - B100","Biodiesel 100","Gallons",1.0149999999999999,"GGE/Gal"]
[null,"E85","Ethanol 85","Gallons",0.72,"GGE/Gal"]
[]
[null,"Fuel Costs"]
[null,null,"$/gallon"]
[null,"Gasoline",3.7]
[null,"Diesel",3.91]
[null,"Propane",3.07]
[null,"Source: Department of Energy, Alternatives Fuels Data Center"]
[null,"http://www.afdc.energy.gov/fuels/prices.html"]
[]
[]
[null,"GHG Emission Factors",null,null,null,null,"Pollutant Emission Factors"]
[]
[null,null,"Upstream","Tailpipe","Total",null,null,"HC","CO","NOx","PM"]
[null,null,"kgCO2e/hp-hr","kgCO2/MMbtu","kgCO2e/hp-hr",null,null,"g/hp-hr","g/hp-hr","g/hp-hr","g/hp-hr"]
[null,"Gasoline",null,71.418199999999999,null,null,"Gasoline",0.27,11.94,0.69,7.7]
[null,"Diesel",null,74.023899999999998,null,null,"Diesel",0.6,2.5,5,0.6]
[null,"Propane",null,61.766100000000002,null,null,"Propane",0.1,3.92,0.85,0.05]
[]
[null,"Source: U.S. Inventory of Greenhouse Gas Emissions and Sinks",null,null,null,null,"Source: Review of Life Cycle GHG Emissions from LPG Riding Mowers"]
[null,"http://epa.gov/climatechange/Downloads/ghgemissions/fastfacts.pdf",null,null,null,null,"http://www.cleancitiessacramento.org/sites/all/themes/cc/files/Final%20LCA_-_LPG%20PERC%20Mower%20v5%201.pdf"]
[]
[null,"Mow Rate Coefficient",null,"Swath overlap"]
[null,108.9,null,0.9]
[null,"Please note: The mow rate coefficient includes the acres per hour dimesions and a 10% time factor for tunring at the end of swaths\n"]
[null,"Source:","http://www.encoreequipment.com/test/wp-content/uploads/2012/06/Mowing-Times-and-Productivity.pdf"]
[]
[null,"Brake Specific Fuel Consumption (BSFC)",null,null,null,null,"Irrigation Levels"]
[]
[null,null,"Btu/hp-hr","EER*","Btu/gallon",null,"1 inch per acre",27000,"gallons"]
[null,"Gasoline",9039,1,125000,null,"Source: http://www.google.com/url?url=http://www.caes.uga.edu/extension/floyd/anr/documents/Howtowateryourlawnright.docx&rct=j&frm=1&q=&esrc=s&sa=U&ei=-CngU86nHo2GyATJ4oB4&ved=0CBQQFjAA&sig2=kHG3DI-Z_HRb7AteKXW87A&usg=AFQjCNEPCO0NcOyb9pPLrRAco6bXCdtqrA"]
[null,"Diesel",7505,{"$f":"C71/C72","v":1.2043970686209193},138000]
[null,"Propane",8134,{"$f":"C71/C73","v":1.111261372018687},91000]
[]
[null,"* Energy Economy Ratio"]
[null,"Please note - Propane is assumed to be derived from natural gas"]
[null,"Source: Review of Life Cycle GHG Emissions from LPG Riding Mowers"]
[null,"http://www.cleancitiessacramento.org/sites/all/themes/cc/files/Final%20LCA_-_LPG%20PERC%20Mower%20v5%201.pdf"]
[null,"Energy Factors: ","http://www.epa.gov/ghgreporting/documents/pdf/2009/GHG-MRR-FinalRule.pdf"]
[]
[]
[null,"Physical Conversions"]
[]
[null,"Area"]
[null,null,null,"sq. foot","sq. mile","sq. yard","sq. meter","sq. kilometer","acre","hectare"]
[null,1,"sq. foot",1,3.5899999999999997E-8,0.1111111,9.2903040000000006E-2,9.2900000000000005E-8,2.3E-5,9.2900000000000008E-6]
[null,1,"sq. mile",27900000,1,3097600,2589988,2.589988,639.99739999999997,258.99880000000002]
[null,1,"sq. yard",9,3.2300000000000002E-7,1,0.83612739999999997,8.3600000000000002E-7,2.0661099999999999E-4,8.3599999999999999E-5]
[null,1,"sq. meter",10.763909999999999,3.8599999999999999E-7,1.1959900000000001,1,9.9999999999999995E-7,2.47104E-4,1E-4]
[null,1,"sq. kilometer",10800000,0.38610220000000001,1195990,1000000,1,247.1044,100]
[null,1,"acre",43560,1.5625000000000001E-3,4839.9629999999997,4046.8249999999998,4.0468589999999999E-3,1,0.4046863]
[null,1,"hectare",107639.1,3.861022E-3,11959.9,10000,0.01,2.471044,1]
[]
[null,"Distance"]
[null,null,null,"meter","kilometer","foot","yard","mile"]
[null,1,"meter",1,1E-3,3.2808299999999999,1.09361,6.2137100000000001E-4]
[null,1,"kilometer",1000,1,3280.83,1093.6130000000001,0.62137120000000001]
[null,1,"foot",0.30480000000000002,3.04801E-4,1,0.3333333,1.8939400000000001E-4]
[null,1,"yard",0.91439999999999999,9.1440300000000005E-4,3,1,5.6818199999999998E-4]
[null,1,"mile",1609.3440000000001,1.6093440000000001,5280,1760,1]
[]
[null,"Energy"]
[null,null,null,"watt-hour","kilowatt-hour","megawatt-hour","gigawatt-hour","joule","kilojoule","megajoule","BTU","MMBtu","therm"]
[null,1,"watt-hour",1,1E-3,9.9999999999999995E-7,1.0000000000000001E-9,3600,3.6,3.5999999999999999E-3,3.4121419999999998,3.4121400000000002E-6,3.4100000000000002E-5]
[null,1,"kilowatt-hour",1000,1,1E-3,9.9999999999999995E-7,3600000,3600,3.6,3412.1419999999998,3.412142E-3,3.4121279999999997E-2]
[null,1,"megawatt-hour",1000000,1000,1,1E-3,3600000000,3600000,3600,3412142,3.4121419999999998,34.121279999999999]
[null,1,"gigawatt-hour",1000000000,1000000,1000,1,3600000000000,3600000000,3600000,3410000000,3412.1419999999998,34121.279999999999]
[null,1,"joule",2.7777800000000001E-4,2.7799999999999997E-7,2.7800000000000002E-10,2.7799999999999998E-13,1,1E-3,9.9999999999999995E-7,9.47817E-4,9.4781700000000002E-10,9.4799999999999995E-9]
[null,1,"kilojoule",0.27777780000000002,2.7777800000000001E-4,2.7799999999999997E-7,2.7800000000000002E-10,1000,1,1E-3,0.94781709999999997,9.47817E-7,9.4800000000000007E-6]
[null,1,"megajoule",277.77780000000001,0.27777780000000002,2.7777800000000001E-4,2.7799999999999997E-7,1000000,1000,1,947.81709999999998,9.47817E-4,9.4781339999999992E-3]
[null,1,"BTU",0.29307109999999997,2.93071E-4,2.9299999999999999E-7,2.9300000000000002E-10,1055.056,1.055056,1.055056E-3,1,9.9999999999999995E-7,1.0000000000000001E-5]
[null,1,"MMBtu",293071.09999999998,293.0711,0.29307109999999997,2.93071E-4,1055056000,1055056,1055.056,1000000,1,9.9999610000000008]
[null,1,"therm",29307.22,29.307220000000001,2.9307219999999998E-2,2.9300000000000001E-5,106000000,105506,105.506,100000.4,0.1000004,1]
[]
[null,"Flow"]
[null,null,null,"centimeter3/hour","foot3/hour","yard3/hour","meter3/hour","gallon/hour","liter/hour"]
[null,1,"centimeter3/hour",1,3.5299999999999997E-5,1.31E-6,9.9999999999999995E-7,2.6417200000000002E-4,1E-3]
[null,1,"foot3/hour",28300,1,3.703704E-2,2.8316850000000001E-2,7.4805190000000001,28.316849999999999]
[null,1,"yard3/hour",765000,27,1,0.76455490000000004,201.97399999999999,764.55489999999998]
[null,1,"meter3/hour",1000000,35.299999999999997,1.3079510000000001,1,264.1721,1000]
[null,1,"gallon/hour",3785.4119999999998,0.13368060000000001,4.9511319999999996E-3,3.7854120000000002E-3,1,3.785412]
[null,1,"liter/hour",1000,3.5314669999999999E-2,1.3079509999999999E-3,1E-3,0.26417210000000002,1]
[]
[null,"Light"]
[null,null,null,"Flame","Foot-Candles","Lux","Meter-Candles"]
[null,1,"Flame",1,4,43.055639999999997,43.055639999999997]
[null,1,"Foot-Candles",0.25,1,10.763909999999999,10.763909999999999]
[null,1,"Lux",2.3225760000000002E-2,9.2903040000000006E-2,1,1]
[null,1,"Meter-Candles",2.3225760000000002E-2,9.2903040000000006E-2,1,1]
[]
[null,"Mass"]
[null,null,null,"gram","kilogram","Megagram (tonne)","Gigagram","Teragram (MMT)","pound","short ton"]
[null,1,"gram",1,1E-3,9.9999999999999995E-7,1.0000000000000001E-9,9.9999999999999998E-13,2.2000000000000001E-3,1.1023100000000001E-6]
[null,1,"kilogram",1000,1,1E-3,9.9999999999999995E-7,1.0000000000000001E-9,2.2046000000000001,1.1023109999999999E-3]
[null,1,"Megagram (tonne)",1000000,1000,1,1E-3,9.9999999999999995E-7,2205,1.102311311]
[null,1,"Gigagram",1000000000,1000000,1000,1,1E-3,2204623,1102.3]
[null,1,"Teragram (MMT)",1000000000000,1000000000,1000000,1000,1,2204622622,1102311]
[null,1,"pound",454,0.45359237000000002,4.53592E-4,4.5359199999999998E-7,4.53592E-10,1,5.0000000000000001E-4]
[null,1,"short ton",907185,907.18474000000003,0.90718474000000004,9.0718500000000002E-4,9.0718499999999998E-7,2000,1]
[]
[null,"Power"]
[null,null,null,"watt","kilowatt","megawatt","BTU/hour"]
[null,1,"watt",1,1E-3,9.9999999999999995E-7,3.4151790000000002]
[null,1,"kilowatt",1000,1,1E-3,3415.1790000000001]
[null,1,"megawatt",1000000,1000,1,3415179]
[null,1,"BTU/hour",0.29281040000000003,2.9281000000000001E-4,2.9299999999999999E-7,1]
[]
[null,"Pressure"]
[null,null,null,"pascal","kilopascal","megapascal","pound/inch2","pound/foot2","millimeters of mercury"]
[null,1,"pascal",1,1E-3,9.9999999999999995E-7,1.45038E-4,2.088543E-2,7.5006170000000002E-3]
[null,1,"kilopascal",1000,1,1E-3,0.14503769999999999,20.885429999999999,7.5006170000000001]
[null,1,"megapascal",1000000,1000,1,145.0377,20885.43,7500.6170000000002]
[null,1,"pound/inch2",6894.7569999999996,6.8947570000000002,6.8947569999999996E-3,1,144,51.714930000000003]
[null,1,"pound/foot2",47.88026,4.7880260000000001E-2,4.7899999999999999E-5,6.9444440000000001E-3,1,0.35913149999999999]
[null,1,"millimeters of mercury",133.32239999999999,0.13332240000000001,1.3332200000000001E-4,1.933677E-2,2.7844959999999999,1]
[]
[null,"Speed"]
[null,null,null,"foot/hour","mile/hour","meter/hour","kilometer/hour"]
[null,1,"foot/hour",1,1.8939400000000001E-4,0.30480000000000002,3.0479999999999998E-4]
[null,1,"mile/hour",5280,1,1609.3440000000001,1.6093440000000001]
[null,1,"meter/hour",3.28084,6.2137100000000001E-4,1,1E-3]
[null,1,"kilometer/hour",3280.84,0.62137120000000001,1000,1]
[]
[null,"Temperature"]
[null,null,null,"Fahrenheit","Celsius"]
[null,1,"Fahrenheit",1,-17.22222]
[null,1,"Celsius",33.799999999999997,1]
[]
[null,"Time"]
[null,null,null,"second","minute","hour","day","week","month (30 days)","year","decade","century"]
[null,1,"second",1,1.6666670000000001E-2,2.7777800000000001E-4,1.1600000000000001E-5,1.6500000000000001E-6,3.8599999999999999E-7,3.1699999999999999E-8,3.17E-9,3.1699999999999999E-10]
[null,1,"minute",60,1,1.6666670000000001E-2,6.9444400000000001E-4,9.9199999999999999E-5,2.3099999999999999E-5,1.9E-6,1.9000000000000001E-7,1.9000000000000001E-8]
[null,1,"hour",3600,60,1,4.1666670000000003E-2,5.9523809999999996E-3,1.3888889999999999E-3,1.1415499999999999E-4,1.1399999999999999E-5,1.1400000000000001E-6]
[null,1,"day",86400,1440,24,1,0.14285709999999999,3.3333330000000001E-2,2.7397260000000001E-3,2.73973E-4,2.7399999999999999E-5]
[null,1,"week",604800,10080,168,7,1,0.23333329999999999,1.917808E-2,1.917808E-3,1.91781E-4]
[null,1,"month (30 days)",2592000,43200,720,30,4.2857139999999996,1,8.2191780000000006E-2,8.2191780000000006E-3,8.2191800000000004E-4]
[null,1,"year",31500000,525600,8760,365,52.142859999999999,12.16667,1,0.1,0.01]
[null,1,"decade",315000000,5256000,87600,3650,521.42859999999996,121.66670000000001,10,1,0.1]
[null,1,"century",3150000000,52600000,876000,36500,5214.2860000000001,1216.6669999999999,100,10,1]
[]
[null,"Volume"]
[null,null,null,"liter","gallon","quart","cubic inch","cubic foot","thousand cubic feet (MCF)","million cubic feet (MMCF)","cubic yard","cubic meter"]
[null,1,"liter",1,0.26417210000000002,1.0566880000000001,61.023739999999997,3.5314669999999999E-2,3.5314700000000003E-5,3.5314699999999999E-8,1.3079509999999999E-3,1E-3]
[null,1,"gallon",3.785412,1,4,231,0.13368060000000001,1.33681E-4,1.3368099999999999E-7,4.9511319999999996E-3,3.7854120000000002E-3]
[null,1,"quart",0.94635290000000005,0.25,1,57.75,3.3420140000000001E-2,3.3420100000000002E-5,3.3420100000000003E-8,1.2377829999999999E-3,9.4635300000000004E-4]
[null,1,"cubic inch",1.6387059999999998E-2,4.329004E-3,1.7316020000000001E-2,1,5.7870399999999998E-4,5.7870399999999997E-7,5.7870400000000001E-10,2.1399999999999998E-5,1.6399999999999999E-5]
[null,1,"cubic foot",28.316849999999999,7.4805190000000001,29.922080000000001,1728,1,1E-3,9.9999999999999995E-7,3.703704E-2,2.8316850000000001E-2]
[null,1,"thousand cubic feet (MCF)",28316.85,7480.5190000000002,29922.080000000002,1728000,1000,1,1E-3,37.037039999999998,28.316849999999999]
[null,1,"million cubic feet (MMCF)",28316850,7480519,29922080,1728000000,1000000,1000,1,37037.040000000001,28316.85]
[null,1,"cubic yard",764.55489999999998,201.97399999999999,807.89610000000005,46656,27,2.7E-2,2.6999999999999999E-5,1,0.76455490000000004]
[null,1,"cubic meter",1000,264.1721,1056.6880000000001,61023.74,35.31467,3.5314669999999999E-2,3.5314700000000003E-5,1.3079510000000001,1]
[null,1,"petroleum barrel",158.99,42,168,9702,5.61,5.6145850000000001E-3,5.6145899999999997E-6,0.21,0.16]
[]
[]
[]
[null,"Wood Conversions"]
[null,null,1.25,"short ton/cord","EIA, Annual Energy Review 2007, Table B3"]
[null,null,0.8,"cords per ton","EIA, Annual Energy Review 2007, Table B3"]

{"sheet":"Results","index":5,"n_rows":76,"n_cols":30,"rows_kept":76,"cut":false,"hidden":false,"merged":[[73,1,73,10],[75,1,78,10]]}
[]
[null,"Results"]
[null,"The results of your analysis are presented below."]
[]
[null,"The tables and charts below summarize the results of your calculations for current and future mowing practices.",null,null,null,null,null,null,null,null,null,null,null,null,null,null,null,null,null,null,null,null,null,null,null,null,null,"Current","Future","Savings"]
[null,null,null,null,null,null,null,null,null,null,null,null,null,null,null,null,null,null,null,null,null,null,null,null,null,null,"Tailpipe",{"$f":"#REF!","v":{"$error":"#REF!"}},{"$f":"#REF!","v":{"$error":"#REF!"}}]
[null,"Mowed Area",null,null,null,null,"Seasonal Fuel Use",null,null,null,null,null,null,null,null,null,null,null,null,null,null,null,null,null,null,null,"Upstream",{"$f":"#REF!","v":{"$error":"#REF!"}},{"$f":"#REF!","v":{"$error":"#REF!"}}]
[null,"Current",null,{"$f":"IFERROR(G50,0)","v":""},"acres",null,"Current",{"$f":"IFERROR(G61,0)","v":0},"GGE*",{"$f":"IFERROR(G64,0)","v":0},"dollars"]
[null,"Future",null,{"$f":"IFERROR(I50,0)","v":""},"acres",null,"Future",{"$f":"IFERROR(I61,0)","v":0},"GGE",{"$f":"IFERROR(I64,0)","v":0},"dollars"]
[null,"Reduced",null,{"$f":"IFERROR(D8-D9,0)","v":0},"acres",null,"Savings",{"$f":"IFERROR(H8-H9,0)","v":0},"GGE",{"$f":"IFERROR(J8-J9,0)","v":0},"dollars"]
[]
[]
[]
[]
[]
[]
[null,null,null,null,null,null,null,"HC","CO","NOx","PM"]
[null,"Seasonal Mowing Hours",null,null,null,null,"Seasonal Greenhouse Gas Emissions"]
[null,"Current",null,{"$f":"IFERROR(G63,0)","v":0},"hours",null,"Current",null,null,{"$f":"G66","v":0},"lbsCO2e**"]
[null,"Future",null,{"$f":"IFERROR(I63,0)","v":0},"hours",null,"Future",null,null,{"$f":"I66","v":0},"lbsCO2e"]
[null,"Savings",null,{"$f":"IFERROR(D19-D20,0)","v":0},"hours",null,"Savings",null,null,{"$f":"K66","v":0},"lbsCO2e"]
[]
[]
[]
[]
[]
[]
[null,"Seasonal Water Use",null,null,null,null,"Seasonal Air Pollutant Emissions (lbs)"]
[null,"Current",null,{"$f":"IFERROR(G65,0)","v":0},"gallons",null,null,"Hydrocarbons (HC)","Carbon Monoxide (CO)","Oxides of Nitrogen (NOx)","Particulate Matter (PM)"]
[null,"Future",null,{"$f":"IFERROR(I65,0)","v":0},"gallons",null,"Current",{"$f":"IFERROR(G68,0)","v":0},{"$f":"IFERROR(G69,0)","v":0},{"$f":"IFERROR(G70,0)","v":0},{"$f":"IFERROR(G71,0)","v":0}]
[null,"Savings",null,{"$f":"IFERROR(D29-D30,0)","v":0},"gallons",null,"Future",{"$f":"IFERROR(I68,0)","v":0},{"$f":"IFERROR(I69,0)","v":0},{"$f":"IFERROR(I70,0)","v":0},{"$f":"IFERROR(I71,0)","v":0}]
[null,null,null,null,null,null,"Savings",{"$f":"IFERROR(H30-H31,0)","v":0},{"$f":"IFERROR(I30-I31,0)","v":0},{"$f":"IFERROR(J30-J31,0)","v":0},{"$f":"IFERROR(K30-K31,0)","v":0}]
[]
[]
[]
[]
[]
[]
[]
[]
[]
[]
[]
[]
[]
[]
[null,"Summary Results for Current and Future Mowing Practices"]
[null,null,null,"Unit",null,null,"Current Practices",null,"Future Practices",null,"Savings"]
[]
[null,"Mowed Area",null,"acres",null,null,{"$f":"IFERROR(Calculations!E13,\"\")","v":""},null,{"$f":"IFERROR(Calculations!E130,0)","v":""},null,{"$f":"IFERROR(G50-I50,0)","v":0}]
[null,"Average Mow Time",null,"hours",null,null,{"$f":"IFERROR(G63/G60,0)","v":0},null,{"$f":"IFERROR(I63/I60,0)","v":0},null,{"$f":"IFERROR(G51-I51,0)","v":0}]
[null,"Mower Deck Size",null,"inches",null,null,{"$f":"IF(Calculations!$E$17=\"Single\",Calculations!E22,\"Multiple Mowers\")","v":46},null,{"$f":"IF(Calculations!$E$17=\"Single\",Calculations!E138,\"Multiple Mowers\")","v":""}]
[null,"Engine Size",null,"horsepower",null,null,{"$f":"IF(Calculations!$E$17=\"Single\",Calculations!E23,\"Multiple Mowers\")","v":20},null,{"$f":"IF(Calculations!$E$17=\"Single\",Calculations!E139,\"Multiple Mowers\")","v":""}]
[null,"Fuel Type",null,null,null,null,{"$f":"IF(Calculations!$E$17=\"Single\",Calculations!E24,\"Multiple Mowers\")","v":"Gasoline"},null,{"$f":"IF(Calculations!$E$17=\"Single\",Calculations!E140,\"Multiple Mowers\")","v":"Gasoline"}]
[null,"Fuel Use per Mow",null,"GGE",null,null,{"$f":"IFERROR(G61/G60,0)","v":0},null,{"$f":"IFERROR(I61/I60,0)","v":0},null,{"$f":"IFERROR(G55-I55,0)","v":0}]
[null,"Fuel Cost per Mow",null,"dollars",null,null,{"$f":"G64/G60","v":0},null,{"$f":"I64/I60","v":0},null,{"$f":"IFERROR(G56-I56,0)","v":0}]
[]
[null,"Seasonal  Current and Future Mowing Practice Totals"]
[null,null,null,"Unit",null,null,"Current Practices",null,"Future Practices",null,"Savings"]
[null,"Mows per Season",null,null,null,null,{"$f":"Calculations!E16","v":26},null,{"$f":"Calculations!E131","v":26},null,{"$f":"IFERROR(G60-I60,0)","v":0}]
[null,"Fuel Use (GGE)",null,"GGE*",null,null,{"$f":"IFERROR(IF(Mowers=TRUE,Calculations!S37,Calculations!I82),0)","v":0},null,{"$f":"IFERROR(IF(Mowers=TRUE,Calculations!S156,Calculations!I204),0)","v":0},null,{"$f":"G61-I61","v":0}]
[null,"Fuel Use (gallons)",null,"gallons",null,null,{"$f":"IF(Calculations!$E$17=\"Single\",Calculations!O34,\"Multiple Mowers\")","v":0},null,{"$f":"IF(Calculations!$E$17=\"Single\",Calculations!O153,\"Multiple Mowers\")","v":0}]
[null,"Mow Time",null,"hours",null,null,{"$f":"IFERROR(IF(Mowers=TRUE,Calculations!S30,Calculations!W72),0)","v":0},null,{"$f":"IF(Mowers=TRUE,Calculations!U149,Calculations!W194)","v":0},null,{"$f":"G63-I63","v":0}]
[null,"Fuel Cost",null,"dollars",null,null,{"$f":"IFERROR(IF(Mowers=TRUE,Calculations!S34,Calculations!AM72),0)","v":0},null,{"$f":"IF(Mowers=TRUE,Calculations!S153,Calculations!AM194)","v":0},null,{"$f":"G64-I64","v":0}]
[null,"Water Use",null,"gallons",null,null,{"$f":"IFERROR(Calculations!M114,0)","v":0},null,{"$f":"IFERROR(Calculations!O239,0)","v":0},null,{"$f":"G65-I65","v":0}]
[null,"Greenhouse Gas Emissions",null,"lbsCO2e**",null,null,{"$f":"IFERROR(IF(Mowers=TRUE,Calculations!M41,Calculations!E100),0)","v":0},null,{"$f":"IF(Mowers=TRUE,Calculations!M160,Calculations!E223)","v":0},null,{"$f":"G66-I66","v":0}]
[null,"Air Pollutants"]
[null,"HC",null,"lbs",null,null,{"$f":"IF(Mowers=TRUE,Calculations!M47,Calculations!E105)","v":0},null,{"$f":"IF(Mowers=TRUE,Calculations!M167,Calculations!E228)","v":0},null,{"$f":"G68-I68","v":0}]
[null,"CO",null,"lbs",null,null,{"$f":"IF(Mowers=TRUE,Calculations!M48,Calculations!E106)","v":0},null,{"$f":"IF(Mowers=TRUE,Calculations!M168,Calculations!E229)","v":0},null,{"$f":"G69-I69","v":0}]
[null,"NOx",null,"lbs",null,null,{"$f":"IF(Mowers=TRUE,Calculations!M49,Calculations!E107)","v":0},null,{"$f":"IF(Mowers=TRUE,Calculations!M169,Calculations!E230)","v":0},null,{"$f":"G70-I70","v":0}]
[null,"PM",null,"lbs",null,null,{"$f":"IF(Mowers=TRUE,Calculations!M50,Calculations!E108)","v":0},null,{"$f":"IF(Mowers=TRUE,Calculations!M170,Calculations!E231)","v":0},null,{"$f":"G71-I71","v":0}]
[]
[]
[null,"* Fuel Saving units are in gallons of gasoline equivalent (GGE) for fuels other than gasoline.  A GGE is the amount of fuel it takes to equal the energy content of one liquid gallon of gasoline.  It is used here to present fuel savings even if you change the fuels used by the mower."]
[]
[null,"** lbsCO2e (pounds of carbon dioxide equivalent) are units used to report greenhouse gas (GHG) savings.  GHGs include carbon dioxide, methane, and nitrous oxide, among others.  GHGs vary in how much they heat the atmosphere and how long they stay in the atmosphere, which can be expressed numericall as a global warming potential (GWP).  For reporting purposes GHGs like methane and nitrous oxide are converted to an equivalent amount of carbon dioxide using their GWP."]

{"sheet":"Scenarios","index":6,"n_rows":5,"n_cols":105,"rows_kept":5,"cut":false,"hidden":false,"merged":[]}
["Scenario Name","How large is the area that you mow?","How frequently do you mow the lawn? Once every…","How many weeks long is the mowing season?","How many mowers do you have?","How large is the mower's deck?","What's the mower's horsepower (hp)?","What type of fuel does the mower use?","What's the average fuel cost?","How fast do you go when you're mowing the lawn?","Name","Deck Size (in)","Horsepower (hp)","Fuel Type","Fuel cost ($/gallon)","Mow speed (mph)","% of total acres","Name","Deck Size (in)","Horsepower (hp)","Fuel Type","Fuel cost ($/gallon)","Mow speed (mph)","% of total acres","Name","Deck Size (in)","Horsepower (hp)","Fuel Type","Fuel cost ($/gallon)","Mow speed (mph)","% of total acres","Name","Deck Size (in)","Horsepower (hp)","Fuel Type","Fuel cost ($/gallon)","Mow speed (mph)","% of total acres","Name","Deck Size (in)","Horsepower (hp)","Fuel Type","Fuel cost ($/gallon)","Mow speed (mph)","% of total acres","What percent of the lawn is irrigated routinely?","How often you irrigate?","How much water do you use?","I would like to mow less area","Acres","% of Total","Do you still plan to mow the \"unmowed\" area a few times each season?  If so, how many?","I would like to mow less often","Once every…","During a season that lasts…","I would like to change the type of mower used","Deck Size:","Horsepower:","Fuel Type:","What's the average fuel cost?","Mow Speed:","Name","Deck Size (in)","Horsepower (hp)","Fuel Type","Fuel cost ($/gallon)","Mow speed (mph)","% of total acres","Name","Deck Size (in)","Horsepower (hp)","Fuel Type","Fuel cost ($/gallon)","Mow speed (mph)","% of total acres","Name","Deck Size (in)","Horsepower (hp)","Fuel Type","Fuel cost ($/gallon)","Mow speed (mph)","% of total acres","Name","Deck Size (in)","Horsepower (hp)","Fuel Type","Fuel cost ($/gallon)","Mow speed (mph)","% of total acres","Name","Deck Size (in)","Horsepower (hp)","Fuel Type","Fuel cost ($/gallon)","Mow speed (mph)","% of total acres","Which of these mowers will you use to mow the 'unmowed' area that you only mow  times per season?","I would like to irrigate less"," What percent of this land do you plan to irrigate?","How often?","How much water do you use?","Do you plan to irrigate the 0.125 acres you no longer mow?","What percent of this land do you plan to irrigate?","How often?","How much water do you use?"]
[{"$f":"'Mowing Scenario'!C152","v":0},{"$f":"'Mowing Scenario'!J21","v":""},{"$f":"'Mowing Scenario'!J23","v":7},{"$f":"'Mowing Scenario'!J25","v":26},{"$f":"'Mowing Scenario'!A30","v":true},{"$f":"'Mowing Scenario'!J34","v":46},{"$f":"'Mowing Scenario'!J36","v":20},{"$f":"'Mowing Scenario'!J38","v":"Gasoline"},{"$f":"'Mowing Scenario'!J40","v":3.7},{"$f":"'Mowing Scenario'!J43","v":5},{"$f":"'Mowing Scenario'!C49","v":""},{"$f":"'Mowing Scenario'!F49","v":46},{"$f":"'Mowing Scenario'!H49","v":20},{"$f":"'Mowing Scenario'!J49","v":"Gasoline"},{"$f":"'Mowing Scenario'!L49","v":3.7},{"$f":"'Mowing Scenario'!N49","v":5},{"$f":"'Mowing Scenario'!P49","v":100},{"$f":"'Mowing Scenario'!C50","v":""},{"$f":"'Mowing Scenario'!F50","v":""},{"$f":"'Mowing Scenario'!H50","v":""},{"$f":"'Mowing Scenario'!J50","v":""},{"$f":"'Mowing Scenario'!L50","v":""},{"$f":"'Mowing Scenario'!N50","v":""},{"$f":"'Mowing Scenario'!P50","v":""},{"$f":"'Mowing Scenario'!C51","v":""},{"$f":"'Mowing Scenario'!F51","v":""},{"$f":"'Mowing Scenario'!H51","v":""},{"$f":"'Mowing Scenario'!J51","v":""},{"$f":"'Mowing Scenario'!L51","v":""},{"$f":"'Mowing Scenario'!N51","v":""},{"$f":"'Mowing Scenario'!P51","v":""},{"$f":"'Mowing Scenario'!C52","v":""},{"$f":"'Mowing Scenario'!F52","v":""},{"$f":"'Mowing Scenario'!H52","v":""},{"$f":"'Mowing Scenario'!J52","v":""},{"$f":"'Mowing Scenario'!L52","v":""},{"$f":"'Mowing Scenario'!N52","v":""},{"$f":"'Mowing Scenario'!P52","v":""},{"$f":"'Mowing Scenario'!C53","v":""},{"$f":"'Mowing Scenario'!F53","v":""},{"$f":"'Mowing Scenario'!H53","v":""},{"$f":"'Mowing Scenario'!J53","v":""},{"$f":"'Mowing Scenario'!L53","v":""},{"$f":"'Mowing Scenario'!N53","v":""},{"$f":"'Mowing Scenario'!P53","v":""},{"$f":"'Mowing Scenario'!J58","v":""},{"$f":"'Mowing Scenario'!J61","v":""},{"$f":"'Mowing Scenario'!J64","v":1},{"$f":"CheckMowArea","v":false},{"$f":"'Mowing Scenario'!L75","v":0},{"$f":"'Mowing Scenario'!N75","v":0},{"$f":"'Mowing Scenario'!L80","v":""},{"$f":"CheckMowLess","v":false},{"$f":"'Mowing Scenario'!L87","v":""},{"$f":"'Mowing Scenario'!L89","v":""},{"$f":"CheckMower","v":false},{"$f":"'Mowing Scenario'!L99","v":""},{"$f":"'Mowing Scenario'!L101","v":""},{"$f":"'Mowing Scenario'!L103","v":"Gasoline"},{"$f":"'Mowing Scenario'!L105","v":""},{"$f":"'Mowing Scenario'!L108","v":""},{"$f":"'Mowing Scenario'!C114","v":""},{"$f":"'Mowing Scenario'!F114","v":""},{"$f":"'Mowing Scenario'!H114","v":""},{"$f":"'Mowing Scenario'!J114","v":""},{"$f":"'Mowing Scenario'!L114","v":""},{"$f":"'Mowing Scenario'!N114","v":""},{"$f":"'Mowing Scenario'!P114","v":""},{"$f":"'Mowing Scenario'!C115","v":""},{"$f":"'Mowing Scenario'!F115","v":""},{"$f":"'Mowing Scenario'!H115","v":""},{"$f":"'Mowing Scenario'!J115","v":""},{"$f":"'Mowing Scenario'!L115","v":""},{"$f":"'Mowing Scenario'!N115","v":""},{"$f":"'Mowing Scenario'!P115","v":""},{"$f":"'Mowing Scenario'!C116","v":""},{"$f":"'Mowing Scenario'!F116","v":""},{"$f":"'Mowing Scenario'!H116","v":""},{"$f":"'Mowing Scenario'!J116","v":""},{"$f":"'Mowing Scenario'!L116","v":""},{"$f":"'Mowing Scenario'!N116","v":""},{"$f":"'Mowing Scenario'!P116","v":""},{"$f":"'Mowing Scenario'!C117","v":""},{"$f":"'Mowing Scenario'!F117","v":""},{"$f":"'Mowing Scenario'!H117","v":""},{"$f":"'Mowing Scenario'!J117","v":""},{"$f":"'Mowing Scenario'!L117","v":""},{"$f":"'Mowing Scenario'!N117","v":""},{"$f":"'Mowing Scenario'!P117","v":""},{"$f":"'Mowing Scenario'!C118","v":""},{"$f":"'Mowing Scenario'!F118","v":""},{"$f":"'Mowing Scenario'!H118","v":""},{"$f":"'Mowing Scenario'!J118","v":""},{"$f":"'Mowing Scenario'!L118","v":""},{"$f":"'Mowing Scenario'!N118","v":""},{"$f":"'Mowing Scenario'!P118","v":""},{"$f":"'Mowing Scenario'!N121","v":""},{"$f":"CheckIrrigate","v":false},{"$f":"'Mowing Scenario'!L129","v":""},{"$f":"'Mowing Scenario'!L131","v":""},{"$f":"'Mowing Scenario'!L133","v":1},{"$f":"'Mowing Scenario'!L136","v":"no"},{"$f":"'Mowing Scenario'!L138","v":""},{"$f":"'Mowing Scenario'!L140","v":""},{"$f":"'Mowing Scenario'!L142","v":1}]
["Default",null,7,26,true,46,20,"Gasoline",3.7,5,null,46,20,"Gasoline",3.7,5,100,null,null,null,null,null,null,null,null,null,null,null,null,null,null,null,null,null,null,null,null,null,null,null,null,null,null,null,null,null,null,1,false,null,null,null,false,null,null,false,null,null,"Gasoline",null,null,null,null,null,null,null,null,null,null,null,null,null,null,null,null,null,null,null,null,null,null,null,null,null,null,null,null,null,null,null,null,null,null,null,null,null,null,false,null,null,1,"no",null,null,1]
["Scenario Name","How large is the area that you mow?","How frequently do you mow the lawn? Once every…","How many weeks long is the mowing season?","How many mowers do you have?","How large is the mower's deck?","What's the mower's horsepower (hp)?","What type of fuel does the mower use?","What's the average fuel cost?","How fast do you go when you're mowing the lawn?","Name","Deck Size (in)","Horsepower (hp)","Fuel Type","Fuel cost ($/gallon)","Mow speed (mph)","% of total acres","Name2","Deck Size (in)3","Horsepower (hp)4","Fuel Type5","Fuel cost ($/gallon)6","Mow speed (mph)7","% of total acres8","Name9","Deck Size (in)10","Horsepower (hp)11","Fuel Type12","Fuel cost ($/gallon)13","Mow speed (mph)14","% of total acres15","Name16","Deck Size (in)17","Horsepower (hp)18","Fuel Type19","Fuel cost ($/gallon)20","Mow speed (mph)21","% of total acres22","Name23","Deck Size (in)24","Horsepower (hp)25","Fuel Type26","Fuel cost ($/gallon)27","Mow speed (mph)28","% of total acres29","What percent of the lawn is irrigated routinely?","How often you irrigate?","How much water do you use?","I would like to mow less area","Acres","% of Total","Do you still plan to mow the \"unmowed\" area a few times each season?  If so, how many?","I would like to mow less often","Once every…","During a season that lasts…","I would like to change the type of mower used","Deck Size:","Horsepower:","Fuel Type:","What's the average fuel cost?30","Mow Speed:","Name31","Deck Size (in)32","Horsepower (hp)33","Fuel Type34","Fuel cost ($/gallon)35","Mow speed (mph)36","% of total acres37","Name38","Deck Size (in)39","Horsepower (hp)40","Fuel Type41","Fuel cost ($/gallon)42","Mow speed (mph)43","% of total acres44","Name45","Deck Size (in)46","Horsepower (hp)47","Fuel Type48","Fuel cost ($/gallon)49","Mow speed (mph)50","% of total acres51","Name52","Deck Size (in)53","Horsepower (hp)54","Fuel Type55","Fuel cost ($/gallon)56","Mow speed (mph)57","% of total acres58","Name59","Deck Size (in)60","Horsepower (hp)61","Fuel Type62","Fuel cost ($/gallon)63","Mow speed (mph)64","% of total acres65","% of total acres66","I would like to irrigate less"," What percent of this land do you plan to irrigate?","How often?","How much water do you use?66","Do you plan to irrigate the 0.125 acres you no longer mow?","What percent of this land do you plan to irrigate?","How often?67","How much water do you use?68"]
["Select a scenario…","",7,26,true,46,20,"Gasoline",3.613,5,"",46,20,"Gasoline",3.613,5,100,"","","","","","","","","","","","","","","","","","","","","","","","","","","","","","",1,false,0,0,"",false,"","",false,"","","Gasoline","","","","","","","","","","","","","","","","","","","","","","","","","","","","","","","","","","","","","","",false,"","",1,"no","","",1]

{"sheet":"Scenarios (2)","index":7,"n_rows":56,"n_cols":105,"rows_kept":56,"cut":false,"hidden":false,"merged":[]}
[]
[{"$f":"'Mowing Scenario'!C152","v":0},{"$f":"'Mowing Scenario'!J21","v":""},{"$f":"'Mowing Scenario'!J23","v":7},{"$f":"'Mowing Scenario'!J25","v":26},{"$f":"'Mowing Scenario'!A30","v":true},{"$f":"'Mowing Scenario'!J34","v":46},{"$f":"'Mowing Scenario'!J36","v":20},{"$f":"'Mowing Scenario'!J38","v":"Gasoline"},{"$f":"'Mowing Scenario'!J40","v":3.7},{"$f":"'Mowing Scenario'!J43","v":5},{"$f":"'Mowing Scenario'!C49","v":""},{"$f":"'Mowing Scenario'!F49","v":46},{"$f":"'Mowing Scenario'!H49","v":20},{"$f":"'Mowing Scenario'!J49","v":"Gasoline"},{"$f":"'Mowing Scenario'!L49","v":3.7},{"$f":"'Mowing Scenario'!N49","v":5},{"$f":"'Mowing Scenario'!P49","v":100},{"$f":"'Mowing Scenario'!C50","v":""},{"$f":"'Mowing Scenario'!F50","v":""},{"$f":"'Mowing Scenario'!H50","v":""},{"$f":"'Mowing Scenario'!J50","v":""},{"$f":"'Mowing Scenario'!L50","v":""},{"$f":"'Mowing Scenario'!N50","v":""},{"$f":"'Mowing Scenario'!P50","v":""},{"$f":"'Mowing Scenario'!C51","v":""},{"$f":"'Mowing Scenario'!F51","v":""},{"$f":"'Mowing Scenario'!H51","v":""},{"$f":"'Mowing Scenario'!J51","v":""},{"$f":"'Mowing Scenario'!L51","v":""},{"$f":"'Mowing Scenario'!N51","v":""},{"$f":"'Mowing Scenario'!P51","v":""},{"$f":"'Mowing Scenario'!C52","v":""},{"$f":"'Mowing Scenario'!F52","v":""},{"$f":"'Mowing Scenario'!H52","v":""},{"$f":"'Mowing Scenario'!J52","v":""},{"$f":"'Mowing Scenario'!L52","v":""},{"$f":"'Mowing Scenario'!N52","v":""},{"$f":"'Mowing Scenario'!P52","v":""},{"$f":"'Mowing Scenario'!C53","v":""},{"$f":"'Mowing Scenario'!F53","v":""},{"$f":"'Mowing Scenario'!H53","v":""},{"$f":"'Mowing Scenario'!J53","v":""},{"$f":"'Mowing Scenario'!L53","v":""},{"$f":"'Mowing Scenario'!N53","v":""},{"$f":"'Mowing Scenario'!P53","v":""},{"$f":"'Mowing Scenario'!J58","v":""},{"$f":"'Mowing Scenario'!J61","v":""},{"$f":"'Mowing Scenario'!J64","v":1},{"$f":"CheckMowArea","v":false},{"$f":"'Mowing Scenario'!L75","v":0},{"$f":"'Mowing Scenario'!N75","v":0},{"$f":"'Mowing Scenario'!L80","v":""},{"$f":"CheckMowLess","v":false},{"$f":"'Mowing Scenario'!L87","v":""},{"$f":"'Mowing Scenario'!L89","v":""},{"$f":"CheckMower","v":false},{"$f":"'Mowing Scenario'!L99","v":""},{"$f":"'Mowing Scenario'!L101","v":""},{"$f":"'Mowing Scenario'!L103","v":"Gasoline"},{"$f":"'Mowing Scenario'!L105","v":""},{"$f":"'Mowing Scenario'!L108","v":""},{"$f":"'Mowing Scenario'!C114","v":""},{"$f":"'Mowing Scenario'!F114","v":""},{"$f":"'Mowing Scenario'!H114","v":""},{"$f":"'Mowing Scenario'!J114","v":""},{"$f":"'Mowing Scenario'!L114","v":""},{"$f":"'Mowing Scenario'!N114","v":""},{"$f":"'Mowing Scenario'!P114","v":""},{"$f":"'Mowing Scenario'!C115","v":""},{"$f":"'Mowing Scenario'!F115","v":""},{"$f":"'Mowing Scenario'!H115","v":""},{"$f":"'Mowing Scenario'!J115","v":""},{"$f":"'Mowing Scenario'!L115","v":""},{"$f":"'Mowing Scenario'!N115","v":""},{"$f":"'Mowing Scenario'!P115","v":""},{"$f":"'Mowing Scenario'!C116","v":""},{"$f":"'Mowing Scenario'!F116","v":""},{"$f":"'Mowing Scenario'!H116","v":""},{"$f":"'Mowing Scenario'!J116","v":""},{"$f":"'Mowing Scenario'!L116","v":""},{"$f":"'Mowing Scenario'!N116","v":""},{"$f":"'Mowing Scenario'!P116","v":""},{"$f":"'Mowing Scenario'!C117","v":""},{"$f":"'Mowing Scenario'!F117","v":""},{"$f":"'Mowing Scenario'!H117","v":""},{"$f":"'Mowing Scenario'!J117","v":""},{"$f":"'Mowing Scenario'!L117","v":""},{"$f":"'Mowing Scenario'!N117","v":""},{"$f":"'Mowing Scenario'!P117","v":""},{"$f":"'Mowing Scenario'!C118","v":""},{"$f":"'Mowing Scenario'!F118","v":""},{"$f":"'Mowing Scenario'!H118","v":""},{"$f":"'Mowing Scenario'!J118","v":""},{"$f":"'Mowing Scenario'!L118","v":""},{"$f":"'Mowing Scenario'!N118","v":""},{"$f":"'Mowing Scenario'!P118","v":""},{"$f":"'Mowing Scenario'!N121","v":""},{"$f":"CheckIrrigate","v":false},{"$f":"'Mowing Scenario'!L129","v":""},{"$f":"'Mowing Scenario'!L131","v":""},{"$f":"'Mowing Scenario'!L133","v":1},{"$f":"'Mowing Scenario'!L136","v":"no"},{"$f":"'Mowing Scenario'!L138","v":""},{"$f":"'Mowing Scenario'!L140","v":""},{"$f":"'Mowing Scenario'!L142","v":1}]
["Default",null,7,26,true,46,20,"Gasoline",3.613,5,null,46,20,"Gasoline",3.613,5,100,null,null,null,null,null,null,null,null,null,null,null,null,null,null,null,null,null,null,null,null,null,null,null,null,null,null,null,null,null,null,1,false,null,null,null,false,null,null,false,null,null,"Gasoline",null,null,null,null,null,null,null,null,null,null,null,null,null,null,null,null,null,null,null,null,null,null,null,null,null,null,null,null,null,null,null,null,null,null,null,null,null,null,false,null,null,1,"no",null,null,1]
["Scenario Name","How large is the area that you mow?","How frequently do you mow the lawn? Once every…","How many weeks long is the mowing season?","How many mowers do you have?","How large is the mower's deck?","What's the mower's horsepower (hp)?","What type of fuel does the mower use?","What's the average fuel cost?","How fast do you go when you're mowing the lawn?","Name","Deck Size (in)","Horsepower (hp)","Fuel Type","Fuel cost ($/gallon)","Mow speed (mph)","% of total acres","Name2","Deck Size (in)3","Horsepower (hp)4","Fuel Type5","Fuel cost ($/gallon)6","Mow speed (mph)7","% of total acres8","Name9","Deck Size (in)10","Horsepower (hp)11","Fuel Type12","Fuel cost ($/gallon)13","Mow speed (mph)14","% of total acres15","Name16","Deck Size (in)17","Horsepower (hp)18","Fuel Type19","Fuel cost ($/gallon)20","Mow speed (mph)21","% of total acres22","Name23","Deck Size (in)24","Horsepower (hp)25","Fuel Type26","Fuel cost ($/gallon)27","Mow speed (mph)28","% of total acres29","What percent of the lawn is irrigated routinely?","How often you irrigate?","How much water do you use?","I would like to mow less area","Acres","% of Total","Do you still plan to mow the \"unmowed\" area a few times each season?  If so, how many?","I would like to mow less often","Once every…","During a season that lasts…","I would like to change the type of mower used","Deck Size:","Horsepower:","Fuel Type:","What's the average fuel cost?30","Mow Speed:","Name31","Deck Size (in)32","Horsepower (hp)33","Fuel Type34","Fuel cost ($/gallon)35","Mow speed (mph)36","% of total acres37","Name38","Deck Size (in)39","Horsepower (hp)40","Fuel Type41","Fuel cost ($/gallon)42","Mow speed (mph)43","% of total acres44","Name45","Deck Size (in)46","Horsepower (hp)47","Fuel Type48","Fuel cost ($/gallon)49","Mow speed (mph)50","% of total acres51","Name52","Deck Size (in)53","Horsepower (hp)54","Fuel Type55","Fuel cost ($/gallon)56","Mow speed (mph)57","% of total acres58","Name59","Deck Size (in)60","Horsepower (hp)61","Fuel Type62","Fuel cost ($/gallon)63","Mow speed (mph)64","% of total acres65","% of total acres66","I would like to irrigate less"," What percent of this land do you plan to irrigate?","How often?","How much water do you use?66","Do you plan to irrigate the 0.125 acres you no longer mow?","What percent of this land do you plan to irrigate?","How often?67","How much water do you use?68"]
["Select a scenario…","",7,26,true,46,20,"Gasoline",3.613,5,"",46,20,"Gasoline",3.613,5,100,"","","","","","","","","","","","","","","","","","","","","","","","","","","","","","",1,false,0,0,"",false,"","",false,"","","Gasoline","","","","","","","","","","","","","","","","","","","","","","","","","","","","","","","","","","","","","","",false,"","",1,"no","","",1]
[{"$f":"IFERROR(Scenarios!A6,\"\")","v":0},{"$f":"IFERROR(Scenarios!B6,\"\")","v":0},{"$f":"IFERROR(Scenarios!C6,\"\")","v":0},{"$f":"IFERROR(Scenarios!D6,\"\")","v":0},{"$f":"IFERROR(Scenarios!E6,\"\")","v":0},{"$f":"IFERROR(Scenarios!F6,\"\")","v":0},{"$f":"IFERROR(Scenarios!G6,\"\")","v":0},{"$f":"IFERROR(Scenarios!H6,\"\")","v":0},{"$f":"IFERROR(Scenarios!I6,\"\")","v":0},{"$f":"IFERROR(Scenarios!J6,\"\")","v":0},{"$f":"IFERROR(Scenarios!K6,\"\")","v":0},{"$f":"IFERROR(Scenarios!L6,\"\")","v":0},{"$f":"IFERROR(Scenarios!M6,\"\")","v":0},{"$f":"IFERROR(Scenarios!N6,\"\")","v":0},{"$f":"IFERROR(Scenarios!O6,\"\")","v":0},{"$f":"IFERROR(Scenarios!P6,\"\")","v":0},{"$f":"IFERROR(Scenarios!Q6,\"\")","v":0},{"$f":"IFERROR(Scenarios!R6,\"\")","v":0},{"$f":"IFERROR(Scenarios!S6,\"\")","v":0},{"$f":"IFERROR(Scenarios!T6,\"\")","v":0},{"$f":"IFERROR(Scenarios!U6,\"\")","v":0},{"$f":"IFERROR(Scenarios!V6,\"\")","v":0},{"$f":"IFERROR(Scenarios!W6,\"\")","v":0},{"$f":"IFERROR(Scenarios!X6,\"\")","v":0},{"$f":"IFERROR(Scenarios!Y6,\"\")","v":0},{"$f":"IFERROR(Scenarios!Z6,\"\")","v":0},{"$f":"IFERROR(Scenarios!AA6,\"\")","v":0},{"$f":"IFERROR(Scenarios!AB6,\"\")","v":0},{"$f":"IFERROR(Scenarios!AC6,\"\")","v":0},{"$f":"IFERROR(Scenarios!AD6,\"\")","v":0},{"$f":"IFERROR(Scenarios!AE6,\"\")","v":0},{"$f":"IFERROR(Scenarios!AF6,\"\")","v":0},{"$f":"IFERROR(Scenarios!AG6,\"\")","v":0},{"$f":"IFERROR(Scenarios!AH6,\"\")","v":0},{"$f":"IFERROR(Scenarios!AI6,\"\")","v":0},{"$f":"IFERROR(Scenarios!AJ6,\"\")","v":0},{"$f":"IFERROR(Scenarios!AK6,\"\")","v":0},{"$f":"IFERROR(Scenarios!AL6,\"\")","v":0},{"$f":"IFERROR(Scenarios!AM6,\"\")","v":0},{"$f":"IFERROR(Scenarios!AN6,\"\")","v":0},{"$f":"IFERROR(Scenarios!AO6,\"\")","v":0},{"$f":"IFERROR(Scenarios!AP6,\"\")","v":0},{"$f":"IFERROR(Scenarios!AQ6,\"\")","v":0},{"$f":"IFERROR(Scenarios!AR6,\"\")","v":0},{"$f":"IFERROR(Scenarios!AS6,\"\")","v":0},{"$f":"IFERROR(Scenarios!AT6,\"\")","v":0},{"$f":"IFERROR(Scenarios!AU6,\"\")","v":0},{"$f":"IFERROR(Scenarios!AV6,\"\")","v":0},{"$f":"IFERROR(Scenarios!AW6,\"\")","v":0},{"$f":"IFERROR(Scenarios!AX6,\"\")","v":0},{"$f":"IFERROR(Scenarios!AY6,\"\")","v":0},{"$f":"IFERROR(Scenarios!AZ6,\"\")","v":0},{"$f":"IFERROR(Scenarios!BA6,\"\")","v":0},{"$f":"IFERROR(Scenarios!BB6,\"\")","v":0},{"$f":"IFERROR(Scenarios!BC6,\"\")","v":0},{"$f":"IFERROR(Scenarios!BD6,\"\")","v":0},{"$f":"IFERROR(Scenarios!BE6,\"\")","v":0},{"$f":"IFERROR(Scenarios!BF6,\"\")","v":0},{"$f":"IFERROR(Scenarios!BG6,\"\")","v":0},{"$f":"IFERROR(Scenarios!BH6,\"\")","v":0},{"$f":"IFERROR(Scenarios!BI6,\"\")","v":0},{"$f":"IFERROR(Scenarios!BJ6,\"\")","v":0},{"$f":"IFERROR(Scenarios!BK6,\"\")","v":0},{"$f":"IFERROR(Scenarios!BL6,\"\")","v":0},{"$f":"IFERROR(Scenarios!BM6,\"\")","v":0},{"$f":"IFERROR(Scenarios!BN6,\"\")","v":0},{"$f":"IFERROR(Scenarios!BO6,\"\")","v":0},{"$f":"IFERROR(Scenarios!BP6,\"\")","v":0},{"$f":"IFERROR(Scenarios!BQ6,\"\")","v":0},{"$f":"IFERROR(Scenarios!BR6,\"\")","v":0},{"$f":"IFERROR(Scenarios!BS6,\"\")","v":0},{"$f":"IFERROR(Scenarios!BT6,\"\")","v":0},{"$f":"IFERROR(Scenarios!BU6,\"\")","v":0},{"$f":"IFERROR(Scenarios!BV6,\"\")","v":0},{"$f":"IFERROR(Scenarios!BW6,\"\")","v":0},{"$f":"IFERROR(Scenarios!BX6,\"\")","v":0},{"$f":"IFERROR(Scenarios!BY6,\"\")","v":0},{"$f":"IFERROR(Scenarios!BZ6,\"\")","v":0},{"$f":"IFERROR(Scenarios!CA6,\"\")","v":0},{"$f":"IFERROR(Scenarios!CB6,\"\")","v":0},{"$f":"IFERROR(Scenarios!CC6,\"\")","v":0},{"$f":"IFERROR(Scenarios!CD6,\"\")","v":0},{"$f":"IFERROR(Scenarios!CE6,\"\")","v":0},{"$f":"IFERROR(Scenarios!CF6,\"\")","v":0},{"$f":"IFERROR(Scenarios!CG6,\"\")","v":0},{"$f":"IFERROR(Scenarios!CH6,\"\")","v":0},{"$f":"IFERROR(Scenarios!CI6,\"\")","v":0},{"$f":"IFERROR(Scenarios!CJ6,\"\")","v":0},{"$f":"IFERROR(Scenarios!CK6,\"\")","v":0},{"$f":"IFERROR(Scenarios!CL6,\"\")","v":0},{"$f":"IFERROR(Scenarios!CM6,\"\")","v":0},{"$f":"IFERROR(Scenarios!CN6,\"\")","v":0},{"$f":"IFERROR(Scenarios!CO6,\"\")","v":0},{"$f":"IFERROR(Scenarios!CP6,\"\")","v":0},{"$f":"IFERROR(Scenarios!CQ6,\"\")","v":0},{"$f":"IFERROR(Scenarios!CR6,\"\")","v":0},{"$f":"IFERROR(Scenarios!CS6,\"\")","v":0},{"$f":"IFERROR(Scenarios!CT6,\"\")","v":0},{"$f":"IFERROR(Scenarios!CU6,\"\")","v":0},{"$f":"IFERROR(Scenarios!CV6,\"\")","v":0},{"$f":"IFERROR(Scenarios!CW6,\"\")","v":0},{"$f":"IFERROR(Scenarios!CX6,\"\")","v":0},{"$f":"IFERROR(Scenarios!CY6,\"\")","v":0},{"$f":"IFERROR(Scenarios!CZ6,\"\")","v":0},{"$f":"IFERROR(Scenarios!DA6,\"\")","v":0}]
[{"$f":"IFERROR(Scenarios!A7,\"\")","v":0},{"$f":"IFERROR(Scenarios!B7,\"\")","v":0},{"$f":"IFERROR(Scenarios!C7,\"\")","v":0},{"$f":"IFERROR(Scenarios!D7,\"\")","v":0},{"$f":"IFERROR(Scenarios!E7,\"\")","v":0},{"$f":"IFERROR(Scenarios!F7,\"\")","v":0},{"$f":"IFERROR(Scenarios!G7,\"\")","v":0},{"$f":"IFERROR(Scenarios!H7,\"\")","v":0},{"$f":"IFERROR(Scenarios!I7,\"\")","v":0},{"$f":"IFERROR(Scenarios!J7,\"\")","v":0},{"$f":"IFERROR(Scenarios!K7,\"\")","v":0},{"$f":"IFERROR(Scenarios!L7,\"\")","v":0},{"$f":"IFERROR(Scenarios!M7,\"\")","v":0},{"$f":"IFERROR(Scenarios!N7,\"\")","v":0},{"$f":"IFERROR(Scenarios!O7,\"\")","v":0},{"$f":"IFERROR(Scenarios!P7,\"\")","v":0},{"$f":"IFERROR(Scenarios!Q7,\"\")","v":0},{"$f":"IFERROR(Scenarios!R7,\"\")","v":0},{"$f":"IFERROR(Scenarios!S7,\"\")","v":0},{"$f":"IFERROR(Scenarios!T7,\"\")","v":0},{"$f":"IFERROR(Scenarios!U7,\"\")","v":0},{"$f":"IFERROR(Scenarios!V7,\"\")","v":0},{"$f":"IFERROR(Scenarios!W7,\"\")","v":0},{"$f":"IFERROR(Scenarios!X7,\"\")","v":0},{"$f":"IFERROR(Scenarios!Y7,\"\")","v":0},{"$f":"IFERROR(Scenarios!Z7,\"\")","v":0},{"$f":"IFERROR(Scenarios!AA7,\"\")","v":0},{"$f":"IFERROR(Scenarios!AB7,\"\")","v":0},{"$f":"IFERROR(Scenarios!AC7,\"\")","v":0},{"$f":"IFERROR(Scenarios!AD7,\"\")","v":0},{"$f":"IFERROR(Scenarios!AE7,\"\")","v":0},{"$f":"IFERROR(Scenarios!AF7,\"\")","v":0},{"$f":"IFERROR(Scenarios!AG7,\"\")","v":0},{"$f":"IFERROR(Scenarios!AH7,\"\")","v":0},{"$f":"IFERROR(Scenarios!AI7,\"\")","v":0},{"$f":"IFERROR(Scenarios!AJ7,\"\")","v":0},{"$f":"IFERROR(Scenarios!AK7,\"\")","v":0},{"$f":"IFERROR(Scenarios!AL7,\"\")","v":0},{"$f":"IFERROR(Scenarios!AM7,\"\")","v":0},{"$f":"IFERROR(Scenarios!AN7,\"\")","v":0},{"$f":"IFERROR(Scenarios!AO7,\"\")","v":0},{"$f":"IFERROR(Scenarios!AP7,\"\")","v":0},{"$f":"IFERROR(Scenarios!AQ7,\"\")","v":0},{"$f":"IFERROR(Scenarios!AR7,\"\")","v":0},{"$f":"IFERROR(Scenarios!AS7,\"\")","v":0},{"$f":"IFERROR(Scenarios!AT7,\"\")","v":0},{"$f":"IFERROR(Scenarios!AU7,\"\")","v":0},{"$f":"IFERROR(Scenarios!AV7,\"\")","v":0},{"$f":"IFERROR(Scenarios!AW7,\"\")","v":0},{"$f":"IFERROR(Scenarios!AX7,\"\")","v":0},{"$f":"IFERROR(Scenarios!AY7,\"\")","v":0},{"$f":"IFERROR(Scenarios!AZ7,\"\")","v":0},{"$f":"IFERROR(Scenarios!BA7,\"\")","v":0},{"$f":"IFERROR(Scenarios!BB7,\"\")","v":0},{"$f":"IFERROR(Scenarios!BC7,\"\")","v":0},{"$f":"IFERROR(Scenarios!BD7,\"\")","v":0},{"$f":"IFERROR(Scenarios!BE7,\"\")","v":0},{"$f":"IFERROR(Scenarios!BF7,\"\")","v":0},{"$f":"IFERROR(Scenarios!BG7,\"\")","v":0},{"$f":"IFERROR(Scenarios!BH7,\"\")","v":0},{"$f":"IFERROR(Scenarios!BI7,\"\")","v":0},{"$f":"IFERROR(Scenarios!BJ7,\"\")","v":0},{"$f":"IFERROR(Scenarios!BK7,\"\")","v":0},{"$f":"IFERROR(Scenarios!BL7,\"\")","v":0},{"$f":"IFERROR(Scenarios!BM7,\"\")","v":0},{"$f":"IFERROR(Scenarios!BN7,\"\")","v":0},{"$f":"IFERROR(Scenarios!BO7,\"\")","v":0},{"$f":"IFERROR(Scenarios!BP7,\"\")","v":0},{"$f":"IFERROR(Scenarios!BQ7,\"\")","v":0},{"$f":"IFERROR(Scenarios!BR7,\"\")","v":0},{"$f":"IFERROR(Scenarios!BS7,\"\")","v":0},{"$f":"IFERROR(Scenarios!BT7,\"\")","v":0},{"$f":"IFERROR(Scenarios!BU7,\"\")","v":0},{"$f":"IFERROR(Scenarios!BV7,\"\")","v":0},{"$f":"IFERROR(Scenarios!BW7,\"\")","v":0},{"$f":"IFERROR(Scenarios!BX7,\"\")","v":0},{"$f":"IFERROR(Scenarios!BY7,\"\")","v":0},{"$f":"IFERROR(Scenarios!BZ7,\"\")","v":0},{"$f":"IFERROR(Scenarios!CA7,\"\")","v":0},{"$f":"IFERROR(Scenarios!CB7,\"\")","v":0},{"$f":"IFERROR(Scenarios!CC7,\"\")","v":0},{"$f":"IFERROR(Scenarios!CD7,\"\")","v":0},{"$f":"IFERROR(Scenarios!CE7,\"\")","v":0},{"$f":"IFERROR(Scenarios!CF7,\"\")","v":0},{"$f":"IFERROR(Scenarios!CG7,\"\")","v":0},{"$f":"IFERROR(Scenarios!CH7,\"\")","v":0},{"$f":"IFERROR(Scenarios!CI7,\"\")","v":0},{"$f":"IFERROR(Scenarios!CJ7,\"\")","v":0},{"$f":"IFERROR(Scenarios!CK7,\"\")","v":0},{"$f":"IFERROR(Scenarios!CL7,\"\")","v":0},{"$f":"IFERROR(Scenarios!CM7,\"\")","v":0},{"$f":"IFERROR(Scenarios!CN7,\"\")","v":0},{"$f":"IFERROR(Scenarios!CO7,\"\")","v":0},{"$f":"IFERROR(Scenarios!CP7,\"\")","v":0},{"$f":"IFERROR(Scenarios!CQ7,\"\")","v":0},{"$f":"IFERROR(Scenarios!CR7,\"\")","v":0},{"$f":"IFERROR(Scenarios!CS7,\"\")","v":0},{"$f":"IFERROR(Scenarios!CT7,\"\")","v":0},{"$f":"IFERROR(Scenarios!CU7,\"\")","v":0},{"$f":"IFERROR(Scenarios!CV7,\"\")","v":0},{"$f":"IFERROR(Scenarios!CW7,\"\")","v":0},{"$f":"IFERROR(Scenarios!CX7,\"\")","v":0},{"$f":"IFERROR(Scenarios!CY7,\"\")","v":0},{"$f":"IFERROR(Scenarios!CZ7,\"\")","v":0},{"$f":"IFERROR(Scenarios!DA7,\"\")","v":0}]
[{"$f":"IFERROR(Scenarios!A8,\"\")","v":0},{"$f":"IFERROR(Scenarios!B8,\"\")","v":0},{"$f":"IFERROR(Scenarios!C8,\"\")","v":0},{"$f":"IFERROR(Scenarios!D8,\"\")","v":0},{"$f":"IFERROR(Scenarios!E8,\"\")","v":0},{"$f":"IFERROR(Scenarios!F8,\"\")","v":0},{"$f":"IFERROR(Scenarios!G8,\"\")","v":0},{"$f":"IFERROR(Scenarios!H8,\"\")","v":0},{"$f":"IFERROR(Scenarios!I8,\"\")","v":0},{"$f":"IFERROR(Scenarios!J8,\"\")","v":0},{"$f":"IFERROR(Scenarios!K8,\"\")","v":0},{"$f":"IFERROR(Scenarios!L8,\"\")","v":0},{"$f":"IFERROR(Scenarios!M8,\"\")","v":0},{"$f":"IFERROR(Scenarios!N8,\"\")","v":0},{"$f":"IFERROR(Scenarios!O8,\"\")","v":0},{"$f":"IFERROR(Scenarios!P8,\"\")","v":0},{"$f":"IFERROR(Scenarios!Q8,\"\")","v":0},{"$f":"IFERROR(Scenarios!R8,\"\")","v":0},{"$f":"IFERROR(Scenarios!S8,\"\")","v":0},{"$f":"IFERROR(Scenarios!T8,\"\")","v":0},{"$f":"IFERROR(Scenarios!U8,\"\")","v":0},{"$f":"IFERROR(Scenarios!V8,\"\")","v":0},{"$f":"IFERROR(Scenarios!W8,\"\")","v":0},{"$f":"IFERROR(Scenarios!X8,\"\")","v":0},{"$f":"IFERROR(Scenarios!Y8,\"\")","v":0},{"$f":"IFERROR(Scenarios!Z8,\"\")","v":0},{"$f":"IFERROR(Scenarios!AA8,\"\")","v":0},{"$f":"IFERROR(Scenarios!AB8,\"\")","v":0},{"$f":"IFERROR(Scenarios!AC8,\"\")","v":0},{"$f":"IFERROR(Scenarios!AD8,\"\")","v":0},{"$f":"IFERROR(Scenarios!AE8,\"\")","v":0},{"$f":"IFERROR(Scenarios!AF8,\"\")","v":0},{"$f":"IFERROR(Scenarios!AG8,\"\")","v":0},{"$f":"IFERROR(Scenarios!AH8,\"\")","v":0},{"$f":"IFERROR(Scenarios!AI8,\"\")","v":0},{"$f":"IFERROR(Scenarios!AJ8,\"\")","v":0},{"$f":"IFERROR(Scenarios!AK8,\"\")","v":0},{"$f":"IFERROR(Scenarios!AL8,\"\")","v":0},{"$f":"IFERROR(Scenarios!AM8,\"\")","v":0},{"$f":"IFERROR(Scenarios!AN8,\"\")","v":0},{"$f":"IFERROR(Scenarios!AO8,\"\")","v":0},{"$f":"IFERROR(Scenarios!AP8,\"\")","v":0},{"$f":"IFERROR(Scenarios!AQ8,\"\")","v":0},{"$f":"IFERROR(Scenarios!AR8,\"\")","v":0},{"$f":"IFERROR(Scenarios!AS8,\"\")","v":0},{"$f":"IFERROR(Scenarios!AT8,\"\")","v":0},{"$f":"IFERROR(Scenarios!AU8,\"\")","v":0},{"$f":"IFERROR(Scenarios!AV8,\"\")","v":0},{"$f":"IFERROR(Scenarios!AW8,\"\")","v":0},{"$f":"IFERROR(Scenarios!AX8,\"\")","v":0},{"$f":"IFERROR(Scenarios!AY8,\"\")","v":0},{"$f":"IFERROR(Scenarios!AZ8,\"\")","v":0},{"$f":"IFERROR(Scenarios!BA8,\"\")","v":0},{"$f":"IFERROR(Scenarios!BB8,\"\")","v":0},{"$f":"IFERROR(Scenarios!BC8,\"\")","v":0},{"$f":"IFERROR(Scenarios!BD8,\"\")","v":0},{"$f":"IFERROR(Scenarios!BE8,\"\")","v":0},{"$f":"IFERROR(Scenarios!BF8,\"\")","v":0},{"$f":"IFERROR(Scenarios!BG8,\"\")","v":0},{"$f":"IFERROR(Scenarios!BH8,\"\")","v":0},{"$f":"IFERROR(Scenarios!BI8,\"\")","v":0},{"$f":"IFERROR(Scenarios!BJ8,\"\")","v":0},{"$f":"IFERROR(Scenarios!BK8,\"\")","v":0},{"$f":"IFERROR(Scenarios!BL8,\"\")","v":0},{"$f":"IFERROR(Scenarios!BM8,\"\")","v":0},{"$f":"IFERROR(Scenarios!BN8,\"\")","v":0},{"$f":"IFERROR(Scenarios!BO8,\"\")","v":0},{"$f":"IFERROR(Scenarios!BP8,\"\")","v":0},{"$f":"IFERROR(Scenarios!BQ8,\"\")","v":0},{"$f":"IFERROR(Scenarios!BR8,\"\")","v":0},{"$f":"IFERROR(Scenarios!BS8,\"\")","v":0},{"$f":"IFERROR(Scenarios!BT8,\"\")","v":0},{"$f":"IFERROR(Scenarios!BU8,\"\")","v":0},{"$f":"IFERROR(Scenarios!BV8,\"\")","v":0},{"$f":"IFERROR(Scenarios!BW8,\"\")","v":0},{"$f":"IFERROR(Scenarios!BX8,\"\")","v":0},{"$f":"IFERROR(Scenarios!BY8,\"\")","v":0},{"$f":"IFERROR(Scenarios!BZ8,\"\")","v":0},{"$f":"IFERROR(Scenarios!CA8,\"\")","v":0},{"$f":"IFERROR(Scenarios!CB8,\"\")","v":0},{"$f":"IFERROR(Scenarios!CC8,\"\")","v":0},{"$f":"IFERROR(Scenarios!CD8,\"\")","v":0},{"$f":"IFERROR(Scenarios!CE8,\"\")","v":0},{"$f":"IFERROR(Scenarios!CF8,\"\")","v":0},{"$f":"IFERROR(Scenarios!CG8,\"\")","v":0},{"$f":"IFERROR(Scenarios!CH8,\"\")","v":0},{"$f":"IFERROR(Scenarios!CI8,\"\")","v":0},{"$f":"IFERROR(Scenarios!CJ8,\"\")","v":0},{"$f":"IFERROR(Scenarios!CK8,\"\")","v":0},{"$f":"IFERROR(Scenarios!CL8,\"\")","v":0},{"$f":"IFERROR(Scenarios!CM8,\"\")","v":0},{"$f":"IFERROR(Scenarios!CN8,\"\")","v":0},{"$f":"IFERROR(Scenarios!CO8,\"\")","v":0},{"$f":"IFERROR(Scenarios!CP8,\"\")","v":0},{"$f":"IFERROR(Scenarios!CQ8,\"\")","v":0},{"$f":"IFERROR(Scenarios!CR8,\"\")","v":0},{"$f":"IFERROR(Scenarios!CS8,\"\")","v":0},{"$f":"IFERROR(Scenarios!CT8,\"\")","v":0},{"$f":"IFERROR(Scenarios!CU8,\"\")","v":0},{"$f":"IFERROR(Scenarios!CV8,\"\")","v":0},{"$f":"IFERROR(Scenarios!CW8,\"\")","v":0},{"$f":"IFERROR(Scenarios!CX8,\"\")","v":0},{"$f":"IFERROR(Scenarios!CY8,\"\")","v":0},{"$f":"IFERROR(Scenarios!CZ8,\"\")","v":0},{"$f":"IFERROR(Scenarios!DA8,\"\")","v":0}]
[{"$f":"IFERROR(Scenarios!A9,\"\")","v":0},{"$f":"IFERROR(Scenarios!B9,\"\")","v":0},{"$f":"IFERROR(Scenarios!C9,\"\")","v":0},{"$f":"IFERROR(Scenarios!D9,\"\")","v":0},{"$f":"IFERROR(Scenarios!E9,\"\")","v":0},{"$f":"IFERROR(Scenarios!F9,\"\")","v":0},{"$f":"IFERROR(Scenarios!G9,\"\")","v":0},{"$f":"IFERROR(Scenarios!H9,\"\")","v":0},{"$f":"IFERROR(Scenarios!I9,\"\")","v":0},{"$f":"IFERROR(Scenarios!J9,\"\")","v":0},{"$f":"IFERROR(Scenarios!K9,\"\")","v":0},{"$f":"IFERROR(Scenarios!L9,\"\")","v":0},{"$f":"IFERROR(Scenarios!M9,\"\")","v":0},{"$f":"IFERROR(Scenarios!N9,\"\")","v":0},{"$f":"IFERROR(Scenarios!O9,\"\")","v":0},{"$f":"IFERROR(Scenarios!P9,\"\")","v":0},{"$f":"IFERROR(Scenarios!Q9,\"\")","v":0},{"$f":"IFERROR(Scenarios!R9,\"\")","v":0},{"$f":"IFERROR(Scenarios!S9,\"\")","v":0},{"$f":"IFERROR(Scenarios!T9,\"\")","v":0},{"$f":"IFERROR(Scenarios!U9,\"\")","v":0},{"$f":"IFERROR(Scenarios!V9,\"\")","v":0},{"$f":"IFERROR(Scenarios!W9,\"\")","v":0},{"$f":"IFERROR(Scenarios!X9,\"\")","v":0},{"$f":"IFERROR(Scenarios!Y9,\"\")","v":0},{"$f":"IFERROR(Scenarios!Z9,\"\")","v":0},{"$f":"IFERROR(Scenarios!AA9,\"\")","v":0},{"$f":"IFERROR(Scenarios!AB9,\"\")","v":0},{"$f":"IFERROR(Scenarios!AC9,\"\")","v":0},{"$f":"IFERROR(Scenarios!AD9,\"\")","v":0},{"$f":"IFERROR(Scenarios!AE9,\"\")","v":0},{"$f":"IFERROR(Scenarios!AF9,\"\")","v":0},{"$f":"IFERROR(Scenarios!AG9,\"\")","v":0},{"$f":"IFERROR(Scenarios!AH9,\"\")","v":0},{"$f":"IFERROR(Scenarios!AI9,\"\")","v":0},{"$f":"IFERROR(Scenarios!AJ9,\"\")","v":0},{"$f":"IFERROR(Scenarios!AK9,\"\")","v":0},{"$f":"IFERROR(Scenarios!AL9,\"\")","v":0},{"$f":"IFERROR(Scenarios!AM9,\"\")","v":0},{"$f":"IFERROR(Scenarios!AN9,\"\")","v":0},{"$f":"IFERROR(Scenarios!AO9,\"\")","v":0},{"$f":"IFERROR(Scenarios!AP9,\"\")","v":0},{"$f":"IFERROR(Scenarios!AQ9,\"\")","v":0},{"$f":"IFERROR(Scenarios!AR9,\"\")","v":0},{"$f":"IFERROR(Scenarios!AS9,\"\")","v":0},{"$f":"IFERROR(Scenarios!AT9,\"\")","v":0},{"$f":"IFERROR(Scenarios!AU9,\"\")","v":0},{"$f":"IFERROR(Scenarios!AV9,\"\")","v":0},{"$f":"IFERROR(Scenarios!AW9,\"\")","v":0},{"$f":"IFERROR(Scenarios!AX9,\"\")","v":0},{"$f":"IFERROR(Scenarios!AY9,\"\")","v":0},{"$f":"IFERROR(Scenarios!AZ9,\"\")","v":0},{"$f":"IFERROR(Scenarios!BA9,\"\")","v":0},{"$f":"IFERROR(Scenarios!BB9,\"\")","v":0},{"$f":"IFERROR(Scenarios!BC9,\"\")","v":0},{"$f":"IFERROR(Scenarios!BD9,\"\")","v":0},{"$f":"IFERROR(Scenarios!BE9,\"\")","v":0},{"$f":"IFERROR(Scenarios!BF9,\"\")","v":0},{"$f":"IFERROR(Scenarios!BG9,\"\")","v":0},{"$f":"IFERROR(Scenarios!BH9,\"\")","v":0},{"$f":"IFERROR(Scenarios!BI9,\"\")","v":0},{"$f":"IFERROR(Scenarios!BJ9,\"\")","v":0},{"$f":"IFERROR(Scenarios!BK9,\"\")","v":0},{"$f":"IFERROR(Scenarios!BL9,\"\")","v":0},{"$f":"IFERROR(Scenarios!BM9,\"\")","v":0},{"$f":"IFERROR(Scenarios!BN9,\"\")","v":0},{"$f":"IFERROR(Scenarios!BO9,\"\")","v":0},{"$f":"IFERROR(Scenarios!BP9,\"\")","v":0},{"$f":"IFERROR(Scenarios!BQ9,\"\")","v":0},{"$f":"IFERROR(Scenarios!BR9,\"\")","v":0},{"$f":"IFERROR(Scenarios!BS9,\"\")","v":0},{"$f":"IFERROR(Scenarios!BT9,\"\")","v":0},{"$f":"IFERROR(Scenarios!BU9,\"\")","v":0},{"$f":"IFERROR(Scenarios!BV9,\"\")","v":0},{"$f":"IFERROR(Scenarios!BW9,\"\")","v":0},{"$f":"IFERROR(Scenarios!BX9,\"\")","v":0},{"$f":"IFERROR(Scenarios!BY9,\"\")","v":0},{"$f":"IFERROR(Scenarios!BZ9,\"\")","v":0},{"$f":"IFERROR(Scenarios!CA9,\"\")","v":0},{"$f":"IFERROR(Scenarios!CB9,\"\")","v":0},{"$f":"IFERROR(Scenarios!CC9,\"\")","v":0},{"$f":"IFERROR(Scenarios!CD9,\"\")","v":0},{"$f":"IFERROR(Scenarios!CE9,\"\")","v":0},{"$f":"IFERROR(Scenarios!CF9,\"\")","v":0},{"$f":"IFERROR(Scenarios!CG9,\"\")","v":0},{"$f":"IFERROR(Scenarios!CH9,\"\")","v":0},{"$f":"IFERROR(Scenarios!CI9,\"\")","v":0},{"$f":"IFERROR(Scenarios!CJ9,\"\")","v":0},{"$f":"IFERROR(Scenarios!CK9,\"\")","v":0},{"$f":"IFERROR(Scenarios!CL9,\"\")","v":0},{"$f":"IFERROR(Scenarios!CM9,\"\")","v":0},{"$f":"IFERROR(Scenarios!CN9,\"\")","v":0},{"$f":"IFERROR(Scenarios!CO9,\"\")","v":0},{"$f":"IFERROR(Scenarios!CP9,\"\")","v":0},{"$f":"IFERROR(Scenarios!CQ9,\"\")","v":0},{"$f":"IFERROR(Scenarios!CR9,\"\")","v":0},{"$f":"IFERROR(Scenarios!CS9,\"\")","v":0},{"$f":"IFERROR(Scenarios!CT9,\"\")","v":0},{"$f":"IFERROR(Scenarios!CU9,\"\")","v":0},{"$f":"IFERROR(Scenarios!CV9,\"\")","v":0},{"$f":"IFERROR(Scenarios!CW9,\"\")","v":0},{"$f":"IFERROR(Scenarios!CX9,\"\")","v":0},{"$f":"IFERROR(Scenarios!CY9,\"\")","v":0},{"$f":"IFERROR(Scenarios!CZ9,\"\")","v":0},{"$f":"IFERROR(Scenarios!DA9,\"\")","v":0}]
[{"$f":"IFERROR(Scenarios!A10,\"\")","v":0},{"$f":"IFERROR(Scenarios!B10,\"\")","v":0},{"$f":"IFERROR(Scenarios!C10,\"\")","v":0},{"$f":"IFERROR(Scenarios!D10,\"\")","v":0},{"$f":"IFERROR(Scenarios!E10,\"\")","v":0},{"$f":"IFERROR(Scenarios!F10,\"\")","v":0},{"$f":"IFERROR(Scenarios!G10,\"\")","v":0},{"$f":"IFERROR(Scenarios!H10,\"\")","v":0},{"$f":"IFERROR(Scenarios!I10,\"\")","v":0},{"$f":"IFERROR(Scenarios!J10,\"\")","v":0},{"$f":"IFERROR(Scenarios!K10,\"\")","v":0},{"$f":"IFERROR(Scenarios!L10,\"\")","v":0},{"$f":"IFERROR(Scenarios!M10,\"\")","v":0},{"$f":"IFERROR(Scenarios!N10,\"\")","v":0},{"$f":"IFERROR(Scenarios!O10,\"\")","v":0},{"$f":"IFERROR(Scenarios!P10,\"\")","v":0},{"$f":"IFERROR(Scenarios!Q10,\"\")","v":0},{"$f":"IFERROR(Scenarios!R10,\"\")","v":0},{"$f":"IFERROR(Scenarios!S10,\"\")","v":0},{"$f":"IFERROR(Scenarios!T10,\"\")","v":0},{"$f":"IFERROR(Scenarios!U10,\"\")","v":0},{"$f":"IFERROR(Scenarios!V10,\"\")","v":0},{"$f":"IFERROR(Scenarios!W10,\"\")","v":0},{"$f":"IFERROR(Scenarios!X10,\"\")","v":0},{"$f":"IFERROR(Scenarios!Y10,\"\")","v":0},{"$f":"IFERROR(Scenarios!Z10,\"\")","v":0},{"$f":"IFERROR(Scenarios!AA10,\"\")","v":0},{"$f":"IFERROR(Scenarios!AB10,\"\")","v":0},{"$f":"IFERROR(Scenarios!AC10,\"\")","v":0},{"$f":"IFERROR(Scenarios!AD10,\"\")","v":0},{"$f":"IFERROR(Scenarios!AE10,\"\")","v":0},{"$f":"IFERROR(Scenarios!AF10,\"\")","v":0},{"$f":"IFERROR(Scenarios!AG10,\"\")","v":0},{"$f":"IFERROR(Scenarios!AH10,\"\")","v":0},{"$f":"IFERROR(Scenarios!AI10,\"\")","v":0},{"$f":"IFERROR(Scenarios!AJ10,\"\")","v":0},{"$f":"IFERROR(Scenarios!AK10,\"\")","v":0},{"$f":"IFERROR(Scenarios!AL10,\"\")","v":0},{"$f":"IFERROR(Scenarios!AM10,\"\")","v":0},{"$f":"IFERROR(Scenarios!AN10,\"\")","v":0},{"$f":"IFERROR(Scenarios!AO10,\"\")","v":0},{"$f":"IFERROR(Scenarios!AP10,\"\")","v":0},{"$f":"IFERROR(Scenarios!AQ10,\"\")","v":0},{"$f":"IFERROR(Scenarios!AR10,\"\")","v":0},{"$f":"IFERROR(Scenarios!AS10,\"\")","v":0},{"$f":"IFERROR(Scenarios!AT10,\"\")","v":0},{"$f":"IFERROR(Scenarios!AU10,\"\")","v":0},{"$f":"IFERROR(Scenarios!AV10,\"\")","v":0},{"$f":"IFERROR(Scenarios!AW10,\"\")","v":0},{"$f":"IFERROR(Scenarios!AX10,\"\")","v":0},{"$f":"IFERROR(Scenarios!AY10,\"\")","v":0},{"$f":"IFERROR(Scenarios!AZ10,\"\")","v":0},{"$f":"IFERROR(Scenarios!BA10,\"\")","v":0},{"$f":"IFERROR(Scenarios!BB10,\"\")","v":0},{"$f":"IFERROR(Scenarios!BC10,\"\")","v":0},{"$f":"IFERROR(Scenarios!BD10,\"\")","v":0},{"$f":"IFERROR(Scenarios!BE10,\"\")","v":0},{"$f":"IFERROR(Scenarios!BF10,\"\")","v":0},{"$f":"IFERROR(Scenarios!BG10,\"\")","v":0},{"$f":"IFERROR(Scenarios!BH10,\"\")","v":0},{"$f":"IFERROR(Scenarios!BI10,\"\")","v":0},{"$f":"IFERROR(Scenarios!BJ10,\"\")","v":0},{"$f":"IFERROR(Scenarios!BK10,\"\")","v":0},{"$f":"IFERROR(Scenarios!BL10,\"\")","v":0},{"$f":"IFERROR(Scenarios!BM10,\"\")","v":0},{"$f":"IFERROR(Scenarios!BN10,\"\")","v":0},{"$f":"IFERROR(Scenarios!BO10,\"\")","v":0},{"$f":"IFERROR(Scenarios!BP10,\"\")","v":0},{"$f":"IFERROR(Scenarios!BQ10,\"\")","v":0},{"$f":"IFERROR(Scenarios!BR10,\"\")","v":0},{"$f":"IFERROR(Scenarios!BS10,\"\")","v":0},{"$f":"IFERROR(Scenarios!BT10,\"\")","v":0},{"$f":"IFERROR(Scenarios!BU10,\"\")","v":0},{"$f":"IFERROR(Scenarios!BV10,\"\")","v":0},{"$f":"IFERROR(Scenarios!BW10,\"\")","v":0},{"$f":"IFERROR(Scenarios!BX10,\"\")","v":0},{"$f":"IFERROR(Scenarios!BY10,\"\")","v":0},{"$f":"IFERROR(Scenarios!BZ10,\"\")","v":0},{"$f":"IFERROR(Scenarios!CA10,\"\")","v":0},{"$f":"IFERROR(Scenarios!CB10,\"\")","v":0},{"$f":"IFERROR(Scenarios!CC10,\"\")","v":0},{"$f":"IFERROR(Scenarios!CD10,\"\")","v":0},{"$f":"IFERROR(Scenarios!CE10,\"\")","v":0},{"$f":"IFERROR(Scenarios!CF10,\"\")","v":0},{"$f":"IFERROR(Scenarios!CG10,\"\")","v":0},{"$f":"IFERROR(Scenarios!CH10,\"\")","v":0},{"$f":"IFERROR(Scenarios!CI10,\"\")","v":0},{"$f":"IFERROR(Scenarios!CJ10,\"\")","v":0},{"$f":"IFERROR(Scenarios!CK10,\"\")","v":0},{"$f":"IFERROR(Scenarios!CL10,\"\")","v":0},{"$f":"IFERROR(Scenarios!CM10,\"\")","v":0},{"$f":"IFERROR(Scenarios!CN10,\"\")","v":0},{"$f":"IFERROR(Scenarios!CO10,\"\")","v":0},{"$f":"IFERROR(Scenarios!CP10,\"\")","v":0},{"$f":"IFERROR(Scenarios!CQ10,\"\")","v":0},{"$f":"IFERROR(Scenarios!CR10,\"\")","v":0},{"$f":"IFERROR(Scenarios!CS10,\"\")","v":0},{"$f":"IFERROR(Scenarios!CT10,\"\")","v":0},{"$f":"IFERROR(Scenarios!CU10,\"\")","v":0},{"$f":"IFERROR(Scenarios!CV10,\"\")","v":0},{"$f":"IFERROR(Scenarios!CW10,\"\")","v":0},{"$f":"IFERROR(Scenarios!CX10,\"\")","v":0},{"$f":"IFERROR(Scenarios!CY10,\"\")","v":0},{"$f":"IFERROR(Scenarios!CZ10,\"\")","v":0},{"$f":"IFERROR(Scenarios!DA10,\"\")","v":0}]
[{"$f":"IFERROR(Scenarios!A11,\"\")","v":0},{"$f":"IFERROR(Scenarios!B11,\"\")","v":0},{"$f":"IFERROR(Scenarios!C11,\"\")","v":0},{"$f":"IFERROR(Scenarios!D11,\"\")","v":0},{"$f":"IFERROR(Scenarios!E11,\"\")","v":0},{"$f":"IFERROR(Scenarios!F11,\"\")","v":0},{"$f":"IFERROR(Scenarios!G11,\"\")","v":0},{"$f":"IFERROR(Scenarios!H11,\"\")","v":0},{"$f":"IFERROR(Scenarios!I11,\"\")","v":0},{"$f":"IFERROR(Scenarios!J11,\"\")","v":0},{"$f":"IFERROR(Scenarios!K11,\"\")","v":0},{"$f":"IFERROR(Scenarios!L11,\"\")","v":0},{"$f":"IFERROR(Scenarios!M11,\"\")","v":0},{"$f":"IFERROR(Scenarios!N11,\"\")","v":0},{"$f":"IFERROR(Scenarios!O11,\"\")","v":0},{"$f":"IFERROR(Scenarios!P11,\"\")","v":0},{"$f":"IFERROR(Scenarios!Q11,\"\")","v":0},{"$f":"IFERROR(Scenarios!R11,\"\")","v":0},{"$f":"IFERROR(Scenarios!S11,\"\")","v":0},{"$f":"IFERROR(Scenarios!T11,\"\")","v":0},{"$f":"IFERROR(Scenarios!U11,\"\")","v":0},{"$f":"IFERROR(Scenarios!V11,\"\")","v":0},{"$f":"IFERROR(Scenarios!W11,\"\")","v":0},{"$f":"IFERROR(Scenarios!X11,\"\")","v":0},{"$f":"IFERROR(Scenarios!Y11,\"\")","v":0},{"$f":"IFERROR(Scenarios!Z11,\"\")","v":0},{"$f":"IFERROR(Scenarios!AA11,\"\")","v":0},{"$f":"IFERROR(Scenarios!AB11,\"\")","v":0},{"$f":"IFERROR(Scenarios!AC11,\"\")","v":0},{"$f":"IFERROR(Scenarios!AD11,\"\")","v":0},{"$f":"IFERROR(Scenarios!AE11,\"\")","v":0},{"$f":"IFERROR(Scenarios!AF11,\"\")","v":0},{"$f":"IFERROR(Scenarios!AG11,\"\")","v":0},{"$f":"IFERROR(Scenarios!AH11,\"\")","v":0},{"$f":"IFERROR(Scenarios!AI11,\"\")","v":0},{"$f":"IFERROR(Scenarios!AJ11,\"\")","v":0},{"$f":"IFERROR(Scenarios!AK11,\"\")","v":0},{"$f":"IFERROR(Scenarios!AL11,\"\")","v":0},{"$f":"IFERROR(Scenarios!AM11,\"\")","v":0},{"$f":"IFERROR(Scenarios!AN11,\"\")","v":0},{"$f":"IFERROR(Scenarios!AO11,\"\")","v":0},{"$f":"IFERROR(Scenarios!AP11,\"\")","v":0},{"$f":"IFERROR(Scenarios!AQ11,\"\")","v":0},{"$f":"IFERROR(Scenarios!AR11,\"\")","v":0},{"$f":"IFERROR(Scenarios!AS11,\"\")","v":0},{"$f":"IFERROR(Scenarios!AT11,\"\")","v":0},{"$f":"IFERROR(Scenarios!AU11,\"\")","v":0},{"$f":"IFERROR(Scenarios!AV11,\"\")","v":0},{"$f":"IFERROR(Scenarios!AW11,\"\")","v":0},{"$f":"IFERROR(Scenarios!AX11,\"\")","v":0},{"$f":"IFERROR(Scenarios!AY11,\"\")","v":0},{"$f":"IFERROR(Scenarios!AZ11,\"\")","v":0},{"$f":"IFERROR(Scenarios!BA11,\"\")","v":0},{"$f":"IFERROR(Scenarios!BB11,\"\")","v":0},{"$f":"IFERROR(Scenarios!BC11,\"\")","v":0},{"$f":"IFERROR(Scenarios!BD11,\"\")","v":0},{"$f":"IFERROR(Scenarios!BE11,\"\")","v":0},{"$f":"IFERROR(Scenarios!BF11,\"\")","v":0},{"$f":"IFERROR(Scenarios!BG11,\"\")","v":0},{"$f":"IFERROR(Scenarios!BH11,\"\")","v":0},{"$f":"IFERROR(Scenarios!BI11,\"\")","v":0},{"$f":"IFERROR(Scenarios!BJ11,\"\")","v":0},{"$f":"IFERROR(Scenarios!BK11,\"\")","v":0},{"$f":"IFERROR(Scenarios!BL11,\"\")","v":0},{"$f":"IFERROR(Scenarios!BM11,\"\")","v":0},{"$f":"IFERROR(Scenarios!BN11,\"\")","v":0},{"$f":"IFERROR(Scenarios!BO11,\"\")","v":0},{"$f":"IFERROR(Scenarios!BP11,\"\")","v":0},{"$f":"IFERROR(Scenarios!BQ11,\"\")","v":0},{"$f":"IFERROR(Scenarios!BR11,\"\")","v":0},{"$f":"IFERROR(Scenarios!BS11,\"\")","v":0},{"$f":"IFERROR(Scenarios!BT11,\"\")","v":0},{"$f":"IFERROR(Scenarios!BU11,\"\")","v":0},{"$f":"IFERROR(Scenarios!BV11,\"\")","v":0},{"$f":"IFERROR(Scenarios!BW11,\"\")","v":0},{"$f":"IFERROR(Scenarios!BX11,\"\")","v":0},{"$f":"IFERROR(Scenarios!BY11,\"\")","v":0},{"$f":"IFERROR(Scenarios!BZ11,\"\")","v":0},{"$f":"IFERROR(Scenarios!CA11,\"\")","v":0},{"$f":"IFERROR(Scenarios!CB11,\"\")","v":0},{"$f":"IFERROR(Scenarios!CC11,\"\")","v":0},{"$f":"IFERROR(Scenarios!CD11,\"\")","v":0},{"$f":"IFERROR(Scenarios!CE11,\"\")","v":0},{"$f":"IFERROR(Scenarios!CF11,\"\")","v":0},{"$f":"IFERROR(Scenarios!CG11,\"\")","v":0},{"$f":"IFERROR(Scenarios!CH11,\"\")","v":0},{"$f":"IFERROR(Scenarios!CI11,\"\")","v":0},{"$f":"IFERROR(Scenarios!CJ11,\"\")","v":0},{"$f":"IFERROR(Scenarios!CK11,\"\")","v":0},{"$f":"IFERROR(Scenarios!CL11,\"\")","v":0},{"$f":"IFERROR(Scenarios!CM11,\"\")","v":0},{"$f":"IFERROR(Scenarios!CN11,\"\")","v":0},{"$f":"IFERROR(Scenarios!CO11,\"\")","v":0},{"$f":"IFERROR(Scenarios!CP11,\"\")","v":0},{"$f":"IFERROR(Scenarios!CQ11,\"\")","v":0},{"$f":"IFERROR(Scenarios!CR11,\"\")","v":0},{"$f":"IFERROR(Scenarios!CS11,\"\")","v":0},{"$f":"IFERROR(Scenarios!CT11,\"\")","v":0},{"$f":"IFERROR(Scenarios!CU11,\"\")","v":0},{"$f":"IFERROR(Scenarios!CV11,\"\")","v":0},{"$f":"IFERROR(Scenarios!CW11,\"\")","v":0},{"$f":"IFERROR(Scenarios!CX11,\"\")","v":0},{"$f":"IFERROR(Scenarios!CY11,\"\")","v":0},{"$f":"IFERROR(Scenarios!CZ11,\"\")","v":0},{"$f":"IFERROR(Scenarios!DA11,\"\")","v":0}]
[{"$f":"IFERROR(Scenarios!A12,\"\")","v":0},{"$f":"IFERROR(Scenarios!B12,\"\")","v":0},{"$f":"IFERROR(Scenarios!C12,\"\")","v":0},{"$f":"IFERROR(Scenarios!D12,\"\")","v":0},{"$f":"IFERROR(Scenarios!E12,\"\")","v":0},{"$f":"IFERROR(Scenarios!F12,\"\")","v":0},{"$f":"IFERROR(Scenarios!G12,\"\")","v":0},{"$f":"IFERROR(Scenarios!H12,\"\")","v":0},{"$f":"IFERROR(Scenarios!I12,\"\")","v":0},{"$f":"IFERROR(Scenarios!J12,\"\")","v":0},{"$f":"IFERROR(Scenarios!K12,\"\")","v":0},{"$f":"IFERROR(Scenarios!L12,\"\")","v":0},{"$f":"IFERROR(Scenarios!M12,\"\")","v":0},{"$f":"IFERROR(Scenarios!N12,\"\")","v":0},{"$f":"IFERROR(Scenarios!O12,\"\")","v":0},{"$f":"IFERROR(Scenarios!P12,\"\")","v":0},{"$f":"IFERROR(Scenarios!Q12,\"\")","v":0},{"$f":"IFERROR(Scenarios!R12,\"\")","v":0},{"$f":"IFERROR(Scenarios!S12,\"\")","v":0},{"$f":"IFERROR(Scenarios!T12,\"\")","v":0},{"$f":"IFERROR(Scenarios!U12,\"\")","v":0},{"$f":"IFERROR(Scenarios!V12,\"\")","v":0},{"$f":"IFERROR(Scenarios!W12,\"\")","v":0},{"$f":"IFERROR(Scenarios!X12,\"\")","v":0},{"$f":"IFERROR(Scenarios!Y12,\"\")","v":0},{"$f":"IFERROR(Scenarios!Z12,\"\")","v":0},{"$f":"IFERROR(Scenarios!AA12,\"\")","v":0},{"$f":"IFERROR(Scenarios!AB12,\"\")","v":0},{"$f":"IFERROR(Scenarios!AC12,\"\")","v":0},{"$f":"IFERROR(Scenarios!AD12,\"\")","v":0},{"$f":"IFERROR(Scenarios!AE12,\"\")","v":0},{"$f":"IFERROR(Scenarios!AF12,\"\")","v":0},{"$f":"IFERROR(Scenarios!AG12,\"\")","v":0},{"$f":"IFERROR(Scenarios!AH12,\"\")","v":0},{"$f":"IFERROR(Scenarios!AI12,\"\")","v":0},{"$f":"IFERROR(Scenarios!AJ12,\"\")","v":0},{"$f":"IFERROR(Scenarios!AK12,\"\")","v":0},{"$f":"IFERROR(Scenarios!AL12,\"\")","v":0},{"$f":"IFERROR(Scenarios!AM12,\"\")","v":0},{"$f":"IFERROR(Scenarios!AN12,\"\")","v":0},{"$f":"IFERROR(Scenarios!AO12,\"\")","v":0},{"$f":"IFERROR(Scenarios!AP12,\"\")","v":0},{"$f":"IFERROR(Scenarios!AQ12,\"\")","v":0},{"$f":"IFERROR(Scenarios!AR12,\"\")","v":0},{"$f":"IFERROR(Scenarios!AS12,\"\")","v":0},{"$f":"IFERROR(Scenarios!AT12,\"\")","v":0},{"$f":"IFERROR(Scenarios!AU12,\"\")","v":0},{"$f":"IFERROR(Scenarios!AV12,\"\")","v":0},{"$f":"IFERROR(Scenarios!AW12,\"\")","v":0},{"$f":"IFERROR(Scenarios!AX12,\"\")","v":0},{"$f":"IFERROR(Scenarios!AY12,\"\")","v":0},{"$f":"IFERROR(Scenarios!AZ12,\"\")","v":0},{"$f":"IFERROR(Scenarios!BA12,\"\")","v":0},{"$f":"IFERROR(Scenarios!BB12,\"\")","v":0},{"$f":"IFERROR(Scenarios!BC12,\"\")","v":0},{"$f":"IFERROR(Scenarios!BD12,\"\")","v":0},{"$f":"IFERROR(Scenarios!BE12,\"\")","v":0},{"$f":"IFERROR(Scenarios!BF12,\"\")","v":0},{"$f":"IFERROR(Scenarios!BG12,\"\")","v":0},{"$f":"IFERROR(Scenarios!BH12,\"\")","v":0},{"$f":"IFERROR(Scenarios!BI12,\"\")","v":0},{"$f":"IFERROR(Scenarios!BJ12,\"\")","v":0},{"$f":"IFERROR(Scenarios!BK12,\"\")","v":0},{"$f":"IFERROR(Scenarios!BL12,\"\")","v":0},{"$f":"IFERROR(Scenarios!BM12,\"\")","v":0},{"$f":"IFERROR(Scenarios!BN12,\"\")","v":0},{"$f":"IFERROR(Scenarios!BO12,\"\")","v":0},{"$f":"IFERROR(Scenarios!BP12,\"\")","v":0},{"$f":"IFERROR(Scenarios!BQ12,\"\")","v":0},{"$f":"IFERROR(Scenarios!BR12,\"\")","v":0},{"$f":"IFERROR(Scenarios!BS12,\"\")","v":0},{"$f":"IFERROR(Scenarios!BT12,\"\")","v":0},{"$f":"IFERROR(Scenarios!BU12,\"\")","v":0},{"$f":"IFERROR(Scenarios!BV12,\"\")","v":0},{"$f":"IFERROR(Scenarios!BW12,\"\")","v":0},{"$f":"IFERROR(Scenarios!BX12,\"\")","v":0},{"$f":"IFERROR(Scenarios!BY12,\"\")","v":0},{"$f":"IFERROR(Scenarios!BZ12,\"\")","v":0},{"$f":"IFERROR(Scenarios!CA12,\"\")","v":0},{"$f":"IFERROR(Scenarios!CB12,\"\")","v":0},{"$f":"IFERROR(Scenarios!CC12,\"\")","v":0},{"$f":"IFERROR(Scenarios!CD12,\"\")","v":0},{"$f":"IFERROR(Scenarios!CE12,\"\")","v":0},{"$f":"IFERROR(Scenarios!CF12,\"\")","v":0},{"$f":"IFERROR(Scenarios!CG12,\"\")","v":0},{"$f":"IFERROR(Scenarios!CH12,\"\")","v":0},{"$f":"IFERROR(Scenarios!CI12,\"\")","v":0},{"$f":"IFERROR(Scenarios!CJ12,\"\")","v":0},{"$f":"IFERROR(Scenarios!CK12,\"\")","v":0},{"$f":"IFERROR(Scenarios!CL12,\"\")","v":0},{"$f":"IFERROR(Scenarios!CM12,\"\")","v":0},{"$f":"IFERROR(Scenarios!CN12,\"\")","v":0},{"$f":"IFERROR(Scenarios!CO12,\"\")","v":0},{"$f":"IFERROR(Scenarios!CP12,\"\")","v":0},{"$f":"IFERROR(Scenarios!CQ12,\"\")","v":0},{"$f":"IFERROR(Scenarios!CR12,\"\")","v":0},{"$f":"IFERROR(Scenarios!CS12,\"\")","v":0},{"$f":"IFERROR(Scenarios!CT12,\"\")","v":0},{"$f":"IFERROR(Scenarios!CU12,\"\")","v":0},{"$f":"IFERROR(Scenarios!CV12,\"\")","v":0},{"$f":"IFERROR(Scenarios!CW12,\"\")","v":0},{"$f":"IFERROR(Scenarios!CX12,\"\")","v":0},{"$f":"IFERROR(Scenarios!CY12,\"\")","v":0},{"$f":"IFERROR(Scenarios!CZ12,\"\")","v":0},{"$f":"IFERROR(Scenarios!DA12,\"\")","v":0}]
[{"$f":"IFERROR(Scenarios!A13,\"\")","v":0},{"$f":"IFERROR(Scenarios!B13,\"\")","v":0},{"$f":"IFERROR(Scenarios!C13,\"\")","v":0},{"$f":"IFERROR(Scenarios!D13,\"\")","v":0},{"$f":"IFERROR(Scenarios!E13,\"\")","v":0},{"$f":"IFERROR(Scenarios!F13,\"\")","v":0},{"$f":"IFERROR(Scenarios!G13,\"\")","v":0},{"$f":"IFERROR(Scenarios!H13,\"\")","v":0},{"$f":"IFERROR(Scenarios!I13,\"\")","v":0},{"$f":"IFERROR(Scenarios!J13,\"\")","v":0},{"$f":"IFERROR(Scenarios!K13,\"\")","v":0},{"$f":"IFERROR(Scenarios!L13,\"\")","v":0},{"$f":"IFERROR(Scenarios!M13,\"\")","v":0},{"$f":"IFERROR(Scenarios!N13,\"\")","v":0},{"$f":"IFERROR(Scenarios!O13,\"\")","v":0},{"$f":"IFERROR(Scenarios!P13,\"\")","v":0},{"$f":"IFERROR(Scenarios!Q13,\"\")","v":0},{"$f":"IFERROR(Scenarios!R13,\"\")","v":0},{"$f":"IFERROR(Scenarios!S13,\"\")","v":0},{"$f":"IFERROR(Scenarios!T13,\"\")","v":0},{"$f":"IFERROR(Scenarios!U13,\"\")","v":0},{"$f":"IFERROR(Scenarios!V13,\"\")","v":0},{"$f":"IFERROR(Scenarios!W13,\"\")","v":0},{"$f":"IFERROR(Scenarios!X13,\"\")","v":0},{"$f":"IFERROR(Scenarios!Y13,\"\")","v":0},{"$f":"IFERROR(Scenarios!Z13,\"\")","v":0},{"$f":"IFERROR(Scenarios!AA13,\"\")","v":0},{"$f":"IFERROR(Scenarios!AB13,\"\")","v":0},{"$f":"IFERROR(Scenarios!AC13,\"\")","v":0},{"$f":"IFERROR(Scenarios!AD13,\"\")","v":0},{"$f":"IFERROR(Scenarios!AE13,\"\")","v":0},{"$f":"IFERROR(Scenarios!AF13,\"\")","v":0},{"$f":"IFERROR(Scenarios!AG13,\"\")","v":0},{"$f":"IFERROR(Scenarios!AH13,\"\")","v":0},{"$f":"IFERROR(Scenarios!AI13,\"\")","v":0},{"$f":"IFERROR(Scenarios!AJ13,\"\")","v":0},{"$f":"IFERROR(Scenarios!AK13,\"\")","v":0},{"$f":"IFERROR(Scenarios!AL13,\"\")","v":0},{"$f":"IFERROR(Scenarios!AM13,\"\")","v":0},{"$f":"IFERROR(Scenarios!AN13,\"\")","v":0},{"$f":"IFERROR(Scenarios!AO13,\"\")","v":0},{"$f":"IFERROR(Scenarios!AP13,\"\")","v":0},{"$f":"IFERROR(Scenarios!AQ13,\"\")","v":0},{"$f":"IFERROR(Scenarios!AR13,\"\")","v":0},{"$f":"IFERROR(Scenarios!AS13,\"\")","v":0},{"$f":"IFERROR(Scenarios!AT13,\"\")","v":0},{"$f":"IFERROR(Scenarios!AU13,\"\")","v":0},{"$f":"IFERROR(Scenarios!AV13,\"\")","v":0},{"$f":"IFERROR(Scenarios!AW13,\"\")","v":0},{"$f":"IFERROR(Scenarios!AX13,\"\")","v":0},{"$f":"IFERROR(Scenarios!AY13,\"\")","v":0},{"$f":"IFERROR(Scenarios!AZ13,\"\")","v":0},{"$f":"IFERROR(Scenarios!BA13,\"\")","v":0},{"$f":"IFERROR(Scenarios!BB13,\"\")","v":0},{"$f":"IFERROR(Scenarios!BC13,\"\")","v":0},{"$f":"IFERROR(Scenarios!BD13,\"\")","v":0},{"$f":"IFERROR(Scenarios!BE13,\"\")","v":0},{"$f":"IFERROR(Scenarios!BF13,\"\")","v":0},{"$f":"IFERROR(Scenarios!BG13,\"\")","v":0},{"$f":"IFERROR(Scenarios!BH13,\"\")","v":0},{"$f":"IFERROR(Scenarios!BI13,\"\")","v":0},{"$f":"IFERROR(Scenarios!BJ13,\"\")","v":0},{"$f":"IFERROR(Scenarios!BK13,\"\")","v":0},{"$f":"IFERROR(Scenarios!BL13,\"\")","v":0},{"$f":"IFERROR(Scenarios!BM13,\"\")","v":0},{"$f":"IFERROR(Scenarios!BN13,\"\")","v":0},{"$f":"IFERROR(Scenarios!BO13,\"\")","v":0},{"$f":"IFERROR(Scenarios!BP13,\"\")","v":0},{"$f":"IFERROR(Scenarios!BQ13,\"\")","v":0},{"$f":"IFERROR(Scenarios!BR13,\"\")","v":0},{"$f":"IFERROR(Scenarios!BS13,\"\")","v":0},{"$f":"IFERROR(Scenarios!BT13,\"\")","v":0},{"$f":"IFERROR(Scenarios!BU13,\"\")","v":0},{"$f":"IFERROR(Scenarios!BV13,\"\")","v":0},{"$f":"IFERROR(Scenarios!BW13,\"\")","v":0},{"$f":"IFERROR(Scenarios!BX13,\"\")","v":0},{"$f":"IFERROR(Scenarios!BY13,\"\")","v":0},{"$f":"IFERROR(Scenarios!BZ13,\"\")","v":0},{"$f":"IFERROR(Scenarios!CA13,\"\")","v":0},{"$f":"IFERROR(Scenarios!CB13,\"\")","v":0},{"$f":"IFERROR(Scenarios!CC13,\"\")","v":0},{"$f":"IFERROR(Scenarios!CD13,\"\")","v":0},{"$f":"IFERROR(Scenarios!CE13,\"\")","v":0},{"$f":"IFERROR(Scenarios!CF13,\"\")","v":0},{"$f":"IFERROR(Scenarios!CG13,\"\")","v":0},{"$f":"IFERROR(Scenarios!CH13,\"\")","v":0},{"$f":"IFERROR(Scenarios!CI13,\"\")","v":0},{"$f":"IFERROR(Scenarios!CJ13,\"\")","v":0},{"$f":"IFERROR(Scenarios!CK13,\"\")","v":0},{"$f":"IFERROR(Scenarios!CL13,\"\")","v":0},{"$f":"IFERROR(Scenarios!CM13,\"\")","v":0},{"$f":"IFERROR(Scenarios!CN13,\"\")","v":0},{"$f":"IFERROR(Scenarios!CO13,\"\")","v":0},{"$f":"IFERROR(Scenarios!CP13,\"\")","v":0},{"$f":"IFERROR(Scenarios!CQ13,\"\")","v":0},{"$f":"IFERROR(Scenarios!CR13,\"\")","v":0},{"$f":"IFERROR(Scenarios!CS13,\"\")","v":0},{"$f":"IFERROR(Scenarios!CT13,\"\")","v":0},{"$f":"IFERROR(Scenarios!CU13,\"\")","v":0},{"$f":"IFERROR(Scenarios!CV13,\"\")","v":0},{"$f":"IFERROR(Scenarios!CW13,\"\")","v":0},{"$f":"IFERROR(Scenarios!CX13,\"\")","v":0},{"$f":"IFERROR(Scenarios!CY13,\"\")","v":0},{"$f":"IFERROR(Scenarios!CZ13,\"\")","v":0},{"$f":"IFERROR(Scenarios!DA13,\"\")","v":0}]
[{"$f":"IFERROR(Scenarios!A14,\"\")","v":0},{"$f":"IFERROR(Scenarios!B14,\"\")","v":0},{"$f":"IFERROR(Scenarios!C14,\"\")","v":0},{"$f":"IFERROR(Scenarios!D14,\"\")","v":0},{"$f":"IFERROR(Scenarios!E14,\"\")","v":0},{"$f":"IFERROR(Scenarios!F14,\"\")","v":0},{"$f":"IFERROR(Scenarios!G14,\"\")","v":0},{"$f":"IFERROR(Scenarios!H14,\"\")","v":0},{"$f":"IFERROR(Scenarios!I14,\"\")","v":0},{"$f":"IFERROR(Scenarios!J14,\"\")","v":0},{"$f":"IFERROR(Scenarios!K14,\"\")","v":0},{"$f":"IFERROR(Scenarios!L14,\"\")","v":0},{"$f":"IFERROR(Scenarios!M14,\"\")","v":0},{"$f":"IFERROR(Scenarios!N14,\"\")","v":0},{"$f":"IFERROR(Scenarios!O14,\"\")","v":0},{"$f":"IFERROR(Scenarios!P14,\"\")","v":0},{"$f":"IFERROR(Scenarios!Q14,\"\")","v":0},{"$f":"IFERROR(Scenarios!R14,\"\")","v":0},{"$f":"IFERROR(Scenarios!S14,\"\")","v":0},{"$f":"IFERROR(Scenarios!T14,\"\")","v":0},{"$f":"IFERROR(Scenarios!U14,\"\")","v":0},{"$f":"IFERROR(Scenarios!V14,\"\")","v":0},{"$f":"IFERROR(Scenarios!W14,\"\")","v":0},{"$f":"IFERROR(Scenarios!X14,\"\")","v":0},{"$f":"IFERROR(Scenarios!Y14,\"\")","v":0},{"$f":"IFERROR(Scenarios!Z14,\"\")","v":0},{"$f":"IFERROR(Scenarios!AA14,\"\")","v":0},{"$f":"IFERROR(Scenarios!AB14,\"\")","v":0},{"$f":"IFERROR(Scenarios!AC14,\"\")","v":0},{"$f":"IFERROR(Scenarios!AD14,\"\")","v":0},{"$f":"IFERROR(Scenarios!AE14,\"\")","v":0},{"$f":"IFERROR(Scenarios!AF14,\"\")","v":0},{"$f":"IFERROR(Scenarios!AG14,\"\")","v":0},{"$f":"IFERROR(Scenarios!AH14,\"\")","v":0},{"$f":"IFERROR(Scenarios!AI14,\"\")","v":0},{"$f":"IFERROR(Scenarios!AJ14,\"\")","v":0},{"$f":"IFERROR(Scenarios!AK14,\"\")","v":0},{"$f":"IFERROR(Scenarios!AL14,\"\")","v":0},{"$f":"IFERROR(Scenarios!AM14,\"\")","v":0},{"$f":"IFERROR(Scenarios!AN14,\"\")","v":0},{"$f":"IFERROR(Scenarios!AO14,\"\")","v":0},{"$f":"IFERROR(Scenarios!AP14,\"\")","v":0},{"$f":"IFERROR(Scenarios!AQ14,\"\")","v":0},{"$f":"IFERROR(Scenarios!AR14,\"\")","v":0},{"$f":"IFERROR(Scenarios!AS14,\"\")","v":0},{"$f":"IFERROR(Scenarios!AT14,\"\")","v":0},{"$f":"IFERROR(Scenarios!AU14,\"\")","v":0},{"$f":"IFERROR(Scenarios!AV14,\"\")","v":0},{"$f":"IFERROR(Scenarios!AW14,\"\")","v":0},{"$f":"IFERROR(Scenarios!AX14,\"\")","v":0},{"$f":"IFERROR(Scenarios!AY14,\"\")","v":0},{"$f":"IFERROR(Scenarios!AZ14,\"\")","v":0},{"$f":"IFERROR(Scenarios!BA14,\"\")","v":0},{"$f":"IFERROR(Scenarios!BB14,\"\")","v":0},{"$f":"IFERROR(Scenarios!BC14,\"\")","v":0},{"$f":"IFERROR(Scenarios!BD14,\"\")","v":0},{"$f":"IFERROR(Scenarios!BE14,\"\")","v":0},{"$f":"IFERROR(Scenarios!BF14,\"\")","v":0},{"$f":"IFERROR(Scenarios!BG14,\"\")","v":0},{"$f":"IFERROR(Scenarios!BH14,\"\")","v":0},{"$f":"IFERROR(Scenarios!BI14,\"\")","v":0},{"$f":"IFERROR(Scenarios!BJ14,\"\")","v":0},{"$f":"IFERROR(Scenarios!BK14,\"\")","v":0},{"$f":"IFERROR(Scenarios!BL14,\"\")","v":0},{"$f":"IFERROR(Scenarios!BM14,\"\")","v":0},{"$f":"IFERROR(Scenarios!BN14,\"\")","v":0},{"$f":"IFERROR(Scenarios!BO14,\"\")","v":0},{"$f":"IFERROR(Scenarios!BP14,\"\")","v":0},{"$f":"IFERROR(Scenarios!BQ14,\"\")","v":0},{"$f":"IFERROR(Scenarios!BR14,\"\")","v":0},{"$f":"IFERROR(Scenarios!BS14,\"\")","v":0},{"$f":"IFERROR(Scenarios!BT14,\"\")","v":0},{"$f":"IFERROR(Scenarios!BU14,\"\")","v":0},{"$f":"IFERROR(Scenarios!BV14,\"\")","v":0},{"$f":"IFERROR(Scenarios!BW14,\"\")","v":0},{"$f":"IFERROR(Scenarios!BX14,\"\")","v":0},{"$f":"IFERROR(Scenarios!BY14,\"\")","v":0},{"$f":"IFERROR(Scenarios!BZ14,\"\")","v":0},{"$f":"IFERROR(Scenarios!CA14,\"\")","v":0},{"$f":"IFERROR(Scenarios!CB14,\"\")","v":0},{"$f":"IFERROR(Scenarios!CC14,\"\")","v":0},{"$f":"IFERROR(Scenarios!CD14,\"\")","v":0},{"$f":"IFERROR(Scenarios!CE14,\"\")","v":0},{"$f":"IFERROR(Scenarios!CF14,\"\")","v":0},{"$f":"IFERROR(Scenarios!CG14,\"\")","v":0},{"$f":"IFERROR(Scenarios!CH14,\"\")","v":0},{"$f":"IFERROR(Scenarios!CI14,\"\")","v":0},{"$f":"IFERROR(Scenarios!CJ14,\"\")","v":0},{"$f":"IFERROR(Scenarios!CK14,\"\")","v":0},{"$f":"IFERROR(Scenarios!CL14,\"\")","v":0},{"$f":"IFERROR(Scenarios!CM14,\"\")","v":0},{"$f":"IFERROR(Scenarios!CN14,\"\")","v":0},{"$f":"IFERROR(Scenarios!CO14,\"\")","v":0},{"$f":"IFERROR(Scenarios!CP14,\"\")","v":0},{"$f":"IFERROR(Scenarios!CQ14,\"\")","v":0},{"$f":"IFERROR(Scenarios!CR14,\"\")","v":0},{"$f":"IFERROR(Scenarios!CS14,\"\")","v":0},{"$f":"IFERROR(Scenarios!CT14,\"\")","v":0},{"$f":"IFERROR(Scenarios!CU14,\"\")","v":0},{"$f":"IFERROR(Scenarios!CV14,\"\")","v":0},{"$f":"IFERROR(Scenarios!CW14,\"\")","v":0},{"$f":"IFERROR(Scenarios!CX14,\"\")","v":0},{"$f":"IFERROR(Scenarios!CY14,\"\")","v":0},{"$f":"IFERROR(Scenarios!CZ14,\"\")","v":0},{"$f":"IFERROR(Scenarios!DA14,\"\")","v":0}]
[{"$f":"IFERROR(Scenarios!A15,\"\")","v":0},{"$f":"IFERROR(Scenarios!B15,\"\")","v":0},{"$f":"IFERROR(Scenarios!C15,\"\")","v":0},{"$f":"IFERROR(Scenarios!D15,\"\")","v":0},{"$f":"IFERROR(Scenarios!E15,\"\")","v":0},{"$f":"IFERROR(Scenarios!F15,\"\")","v":0},{"$f":"IFERROR(Scenarios!G15,\"\")","v":0},{"$f":"IFERROR(Scenarios!H15,\"\")","v":0},{"$f":"IFERROR(Scenarios!I15,\"\")","v":0},{"$f":"IFERROR(Scenarios!J15,\"\")","v":0},{"$f":"IFERROR(Scenarios!K15,\"\")","v":0},{"$f":"IFERROR(Scenarios!L15,\"\")","v":0},{"$f":"IFERROR(Scenarios!M15,\"\")","v":0},{"$f":"IFERROR(Scenarios!N15,\"\")","v":0},{"$f":"IFERROR(Scenarios!O15,\"\")","v":0},{"$f":"IFERROR(Scenarios!P15,\"\")","v":0},{"$f":"IFERROR(Scenarios!Q15,\"\")","v":0},{"$f":"IFERROR(Scenarios!R15,\"\")","v":0},{"$f":"IFERROR(Scenarios!S15,\"\")","v":0},{"$f":"IFERROR(Scenarios!T15,\"\")","v":0},{"$f":"IFERROR(Scenarios!U15,\"\")","v":0},{"$f":"IFERROR(Scenarios!V15,\"\")","v":0},{"$f":"IFERROR(Scenarios!W15,\"\")","v":0},{"$f":"IFERROR(Scenarios!X15,\"\")","v":0},{"$f":"IFERROR(Scenarios!Y15,\"\")","v":0},{"$f":"IFERROR(Scenarios!Z15,\"\")","v":0},{"$f":"IFERROR(Scenarios!AA15,\"\")","v":0},{"$f":"IFERROR(Scenarios!AB15,\"\")","v":0},{"$f":"IFERROR(Scenarios!AC15,\"\")","v":0},{"$f":"IFERROR(Scenarios!AD15,\"\")","v":0},{"$f":"IFERROR(Scenarios!AE15,\"\")","v":0},{"$f":"IFERROR(Scenarios!AF15,\"\")","v":0},{"$f":"IFERROR(Scenarios!AG15,\"\")","v":0},{"$f":"IFERROR(Scenarios!AH15,\"\")","v":0},{"$f":"IFERROR(Scenarios!AI15,\"\")","v":0},{"$f":"IFERROR(Scenarios!AJ15,\"\")","v":0},{"$f":"IFERROR(Scenarios!AK15,\"\")","v":0},{"$f":"IFERROR(Scenarios!AL15,\"\")","v":0},{"$f":"IFERROR(Scenarios!AM15,\"\")","v":0},{"$f":"IFERROR(Scenarios!AN15,\"\")","v":0},{"$f":"IFERROR(Scenarios!AO15,\"\")","v":0},{"$f":"IFERROR(Scenarios!AP15,\"\")","v":0},{"$f":"IFERROR(Scenarios!AQ15,\"\")","v":0},{"$f":"IFERROR(Scenarios!AR15,\"\")","v":0},{"$f":"IFERROR(Scenarios!AS15,\"\")","v":0},{"$f":"IFERROR(Scenarios!AT15,\"\")","v":0},{"$f":"IFERROR(Scenarios!AU15,\"\")","v":0},{"$f":"IFERROR(Scenarios!AV15,\"\")","v":0},{"$f":"IFERROR(Scenarios!AW15,\"\")","v":0},{"$f":"IFERROR(Scenarios!AX15,\"\")","v":0},{"$f":"IFERROR(Scenarios!AY15,\"\")","v":0},{"$f":"IFERROR(Scenarios!AZ15,\"\")","v":0},{"$f":"IFERROR(Scenarios!BA15,\"\")","v":0},{"$f":"IFERROR(Scenarios!BB15,\"\")","v":0},{"$f":"IFERROR(Scenarios!BC15,\"\")","v":0},{"$f":"IFERROR(Scenarios!BD15,\"\")","v":0},{"$f":"IFERROR(Scenarios!BE15,\"\")","v":0},{"$f":"IFERROR(Scenarios!BF15,\"\")","v":0},{"$f":"IFERROR(Scenarios!BG15,\"\")","v":0},{"$f":"IFERROR(Scenarios!BH15,\"\")","v":0},{"$f":"IFERROR(Scenarios!BI15,\"\")","v":0},{"$f":"IFERROR(Scenarios!BJ15,\"\")","v":0},{"$f":"IFERROR(Scenarios!BK15,\"\")","v":0},{"$f":"IFERROR(Scenarios!BL15,\"\")","v":0},{"$f":"IFERROR(Scenarios!BM15,\"\")","v":0},{"$f":"IFERROR(Scenarios!BN15,\"\")","v":0},{"$f":"IFERROR(Scenarios!BO15,\"\")","v":0},{"$f":"IFERROR(Scenarios!BP15,\"\")","v":0},{"$f":"IFERROR(Scenarios!BQ15,\"\")","v":0},{"$f":"IFERROR(Scenarios!BR15,\"\")","v":0},{"$f":"IFERROR(Scenarios!BS15,\"\")","v":0},{"$f":"IFERROR(Scenarios!BT15,\"\")","v":0},{"$f":"IFERROR(Scenarios!BU15,\"\")","v":0},{"$f":"IFERROR(Scenarios!BV15,\"\")","v":0},{"$f":"IFERROR(Scenarios!BW15,\"\")","v":0},{"$f":"IFERROR(Scenarios!BX15,\"\")","v":0},{"$f":"IFERROR(Scenarios!BY15,\"\")","v":0},{"$f":"IFERROR(Scenarios!BZ15,\"\")","v":0},{"$f":"IFERROR(Scenarios!CA15,\"\")","v":0},{"$f":"IFERROR(Scenarios!CB15,\"\")","v":0},{"$f":"IFERROR(Scenarios!CC15,\"\")","v":0},{"$f":"IFERROR(Scenarios!CD15,\"\")","v":0},{"$f":"IFERROR(Scenarios!CE15,\"\")","v":0},{"$f":"IFERROR(Scenarios!CF15,\"\")","v":0},{"$f":"IFERROR(Scenarios!CG15,\"\")","v":0},{"$f":"IFERROR(Scenarios!CH15,\"\")","v":0},{"$f":"IFERROR(Scenarios!CI15,\"\")","v":0},{"$f":"IFERROR(Scenarios!CJ15,\"\")","v":0},{"$f":"IFERROR(Scenarios!CK15,\"\")","v":0},{"$f":"IFERROR(Scenarios!CL15,\"\")","v":0},{"$f":"IFERROR(Scenarios!CM15,\"\")","v":0},{"$f":"IFERROR(Scenarios!CN15,\"\")","v":0},{"$f":"IFERROR(Scenarios!CO15,\"\")","v":0},{"$f":"IFERROR(Scenarios!CP15,\"\")","v":0},{"$f":"IFERROR(Scenarios!CQ15,\"\")","v":0},{"$f":"IFERROR(Scenarios!CR15,\"\")","v":0},{"$f":"IFERROR(Scenarios!CS15,\"\")","v":0},{"$f":"IFERROR(Scenarios!CT15,\"\")","v":0},{"$f":"IFERROR(Scenarios!CU15,\"\")","v":0},{"$f":"IFERROR(Scenarios!CV15,\"\")","v":0},{"$f":"IFERROR(Scenarios!CW15,\"\")","v":0},{"$f":"IFERROR(Scenarios!CX15,\"\")","v":0},{"$f":"IFERROR(Scenarios!CY15,\"\")","v":0},{"$f":"IFERROR(Scenarios!CZ15,\"\")","v":0},{"$f":"IFERROR(Scenarios!DA15,\"\")","v":0}]
[{"$f":"IFERROR(Scenarios!A16,\"\")","v":0},{"$f":"IFERROR(Scenarios!B16,\"\")","v":0},{"$f":"IFERROR(Scenarios!C16,\"\")","v":0},{"$f":"IFERROR(Scenarios!D16,\"\")","v":0},{"$f":"IFERROR(Scenarios!E16,\"\")","v":0},{"$f":"IFERROR(Scenarios!F16,\"\")","v":0},{"$f":"IFERROR(Scenarios!G16,\"\")","v":0},{"$f":"IFERROR(Scenarios!H16,\"\")","v":0},{"$f":"IFERROR(Scenarios!I16,\"\")","v":0},{"$f":"IFERROR(Scenarios!J16,\"\")","v":0},{"$f":"IFERROR(Scenarios!K16,\"\")","v":0},{"$f":"IFERROR(Scenarios!L16,\"\")","v":0},{"$f":"IFERROR(Scenarios!M16,\"\")","v":0},{"$f":"IFERROR(Scenarios!N16,\"\")","v":0},{"$f":"IFERROR(Scenarios!O16,\"\")","v":0},{"$f":"IFERROR(Scenarios!P16,\"\")","v":0},{"$f":"IFERROR(Scenarios!Q16,\"\")","v":0},{"$f":"IFERROR(Scenarios!R16,\"\")","v":0},{"$f":"IFERROR(Scenarios!S16,\"\")","v":0},{"$f":"IFERROR(Scenarios!T16,\"\")","v":0},{"$f":"IFERROR(Scenarios!U16,\"\")","v":0},{"$f":"IFERROR(Scenarios!V16,\"\")","v":0},{"$f":"IFERROR(Scenarios!W16,\"\")","v":0},{"$f":"IFERROR(Scenarios!X16,\"\")","v":0},{"$f":"IFERROR(Scenarios!Y16,\"\")","v":0},{"$f":"IFERROR(Scenarios!Z16,\"\")","v":0},{"$f":"IFERROR(Scenarios!AA16,\"\")","v":0},{"$f":"IFERROR(Scenarios!AB16,\"\")","v":0},{"$f":"IFERROR(Scenarios!AC16,\"\")","v":0},{"$f":"IFERROR(Scenarios!AD16,\"\")","v":0},{"$f":"IFERROR(Scenarios!AE16,\"\")","v":0},{"$f":"IFERROR(Scenarios!AF16,\"\")","v":0},{"$f":"IFERROR(Scenarios!AG16,\"\")","v":0},{"$f":"IFERROR(Scenarios!AH16,\"\")","v":0},{"$f":"IFERROR(Scenarios!AI16,\"\")","v":0},{"$f":"IFERROR(Scenarios!AJ16,\"\")","v":0},{"$f":"IFERROR(Scenarios!AK16,\"\")","v":0},{"$f":"IFERROR(Scenarios!AL16,\"\")","v":0},{"$f":"IFERROR(Scenarios!AM16,\"\")","v":0},{"$f":"IFERROR(Scenarios!AN16,\"\")","v":0},{"$f":"IFERROR(Scenarios!AO16,\"\")","v":0},{"$f":"IFERROR(Scenarios!AP16,\"\")","v":0},{"$f":"IFERROR(Scenarios!AQ16,\"\")","v":0},{"$f":"IFERROR(Scenarios!AR16,\"\")","v":0},{"$f":"IFERROR(Scenarios!AS16,\"\")","v":0},{"$f":"IFERROR(Scenarios!AT16,\"\")","v":0},{"$f":"IFERROR(Scenarios!AU16,\"\")","v":0},{"$f":"IFERROR(Scenarios!AV16,\"\")","v":0},{"$f":"IFERROR(Scenarios!AW16,\"\")","v":0},{"$f":"IFERROR(Scenarios!AX16,\"\")","v":0},{"$f":"IFERROR(Scenarios!AY16,\"\")","v":0},{"$f":"IFERROR(Scenarios!AZ16,\"\")","v":0},{"$f":"IFERROR(Scenarios!BA16,\"\")","v":0},{"$f":"IFERROR(Scenarios!BB16,\"\")","v":0},{"$f":"IFERROR(Scenarios!BC16,\"\")","v":0},{"$f":"IFERROR(Scenarios!BD16,\"\")","v":0},{"$f":"IFERROR(Scenarios!BE16,\"\")","v":0},{"$f":"IFERROR(Scenarios!BF16,\"\")","v":0},{"$f":"IFERROR(Scenarios!BG16,\"\")","v":0},{"$f":"IFERROR(Scenarios!BH16,\"\")","v":0},{"$f":"IFERROR(Scenarios!BI16,\"\")","v":0},{"$f":"IFERROR(Scenarios!BJ16,\"\")","v":0},{"$f":"IFERROR(Scenarios!BK16,\"\")","v":0},{"$f":"IFERROR(Scenarios!BL16,\"\")","v":0},{"$f":"IFERROR(Scenarios!BM16,\"\")","v":0},{"$f":"IFERROR(Scenarios!BN16,\"\")","v":0},{"$f":"IFERROR(Scenarios!BO16,\"\")","v":0},{"$f":"IFERROR(Scenarios!BP16,\"\")","v":0},{"$f":"IFERROR(Scenarios!BQ16,\"\")","v":0},{"$f":"IFERROR(Scenarios!BR16,\"\")","v":0},{"$f":"IFERROR(Scenarios!BS16,\"\")","v":0},{"$f":"IFERROR(Scenarios!BT16,\"\")","v":0},{"$f":"IFERROR(Scenarios!BU16,\"\")","v":0},{"$f":"IFERROR(Scenarios!BV16,\"\")","v":0},{"$f":"IFERROR(Scenarios!BW16,\"\")","v":0},{"$f":"IFERROR(Scenarios!BX16,\"\")","v":0},{"$f":"IFERROR(Scenarios!BY16,\"\")","v":0},{"$f":"IFERROR(Scenarios!BZ16,\"\")","v":0},{"$f":"IFERROR(Scenarios!CA16,\"\")","v":0},{"$f":"IFERROR(Scenarios!CB16,\"\")","v":0},{"$f":"IFERROR(Scenarios!CC16,\"\")","v":0},{"$f":"IFERROR(Scenarios!CD16,\"\")","v":0},{"$f":"IFERROR(Scenarios!CE16,\"\")","v":0},{"$f":"IFERROR(Scenarios!CF16,\"\")","v":0},{"$f":"IFERROR(Scenarios!CG16,\"\")","v":0},{"$f":"IFERROR(Scenarios!CH16,\"\")","v":0},{"$f":"IFERROR(Scenarios!CI16,\"\")","v":0},{"$f":"IFERROR(Scenarios!CJ16,\"\")","v":0},{"$f":"IFERROR(Scenarios!CK16,\"\")","v":0},{"$f":"IFERROR(Scenarios!CL16,\"\")","v":0},{"$f":"IFERROR(Scenarios!CM16,\"\")","v":0},{"$f":"IFERROR(Scenarios!CN16,\"\")","v":0},{"$f":"IFERROR(Scenarios!CO16,\"\")","v":0},{"$f":"IFERROR(Scenarios!CP16,\"\")","v":0},{"$f":"IFERROR(Scenarios!CQ16,\"\")","v":0},{"$f":"IFERROR(Scenarios!CR16,\"\")","v":0},{"$f":"IFERROR(Scenarios!CS16,\"\")","v":0},{"$f":"IFERROR(Scenarios!CT16,\"\")","v":0},{"$f":"IFERROR(Scenarios!CU16,\"\")","v":0},{"$f":"IFERROR(Scenarios!CV16,\"\")","v":0},{"$f":"IFERROR(Scenarios!CW16,\"\")","v":0},{"$f":"IFERROR(Scenarios!CX16,\"\")","v":0},{"$f":"IFERROR(Scenarios!CY16,\"\")","v":0},{"$f":"IFERROR(Scenarios!CZ16,\"\")","v":0},{"$f":"IFERROR(Scenarios!DA16,\"\")","v":0}]
[{"$f":"IFERROR(Scenarios!A17,\"\")","v":0},{"$f":"IFERROR(Scenarios!B17,\"\")","v":0},{"$f":"IFERROR(Scenarios!C17,\"\")","v":0},{"$f":"IFERROR(Scenarios!D17,\"\")","v":0},{"$f":"IFERROR(Scenarios!E17,\"\")","v":0},{"$f":"IFERROR(Scenarios!F17,\"\")","v":0},{"$f":"IFERROR(Scenarios!G17,\"\")","v":0},{"$f":"IFERROR(Scenarios!H17,\"\")","v":0},{"$f":"IFERROR(Scenarios!I17,\"\")","v":0},{"$f":"IFERROR(Scenarios!J17,\"\")","v":0},{"$f":"IFERROR(Scenarios!K17,\"\")","v":0},{"$f":"IFERROR(Scenarios!L17,\"\")","v":0},{"$f":"IFERROR(Scenarios!M17,\"\")","v":0},{"$f":"IFERROR(Scenarios!N17,\"\")","v":0},{"$f":"IFERROR(Scenarios!O17,\"\")","v":0},{"$f":"IFERROR(Scenarios!P17,\"\")","v":0},{"$f":"IFERROR(Scenarios!Q17,\"\")","v":0},{"$f":"IFERROR(Scenarios!R17,\"\")","v":0},{"$f":"IFERROR(Scenarios!S17,\"\")","v":0},{"$f":"IFERROR(Scenarios!T17,\"\")","v":0},{"$f":"IFERROR(Scenarios!U17,\"\")","v":0},{"$f":"IFERROR(Scenarios!V17,\"\")","v":0},{"$f":"IFERROR(Scenarios!W17,\"\")","v":0},{"$f":"IFERROR(Scenarios!X17,\"\")","v":0},{"$f":"IFERROR(Scenarios!Y17,\"\")","v":0},{"$f":"IFERROR(Scenarios!Z17,\"\")","v":0},{"$f":"IFERROR(Scenarios!AA17,\"\")","v":0},{"$f":"IFERROR(Scenarios!AB17,\"\")","v":0},{"$f":"IFERROR(Scenarios!AC17,\"\")","v":0},{"$f":"IFERROR(Scenarios!AD17,\"\")","v":0},{"$f":"IFERROR(Scenarios!AE17,\"\")","v":0},{"$f":"IFERROR(Scenarios!AF17,\"\")","v":0},{"$f":"IFERROR(Scenarios!AG17,\"\")","v":0},{"$f":"IFERROR(Scenarios!AH17,\"\")","v":0},{"$f":"IFERROR(Scenarios!AI17,\"\")","v":0},{"$f":"IFERROR(Scenarios!AJ17,\"\")","v":0},{"$f":"IFERROR(Scenarios!AK17,\"\")","v":0},{"$f":"IFERROR(Scenarios!AL17,\"\")","v":0},{"$f":"IFERROR(Scenarios!AM17,\"\")","v":0},{"$f":"IFERROR(Scenarios!AN17,\"\")","v":0},{"$f":"IFERROR(Scenarios!AO17,\"\")","v":0},{"$f":"IFERROR(Scenarios!AP17,\"\")","v":0},{"$f":"IFERROR(Scenarios!AQ17,\"\")","v":0},{"$f":"IFERROR(Scenarios!AR17,\"\")","v":0},{"$f":"IFERROR(Scenarios!AS17,\"\")","v":0},{"$f":"IFERROR(Scenarios!AT17,\"\")","v":0},{"$f":"IFERROR(Scenarios!AU17,\"\")","v":0},{"$f":"IFERROR(Scenarios!AV17,\"\")","v":0},{"$f":"IFERROR(Scenarios!AW17,\"\")","v":0},{"$f":"IFERROR(Scenarios!AX17,\"\")","v":0},{"$f":"IFERROR(Scenarios!AY17,\"\")","v":0},{"$f":"IFERROR(Scenarios!AZ17,\"\")","v":0},{"$f":"IFERROR(Scenarios!BA17,\"\")","v":0},{"$f":"IFERROR(Scenarios!BB17,\"\")","v":0},{"$f":"IFERROR(Scenarios!BC17,\"\")","v":0},{"$f":"IFERROR(Scenarios!BD17,\"\")","v":0},{"$f":"IFERROR(Scenarios!BE17,\"\")","v":0},{"$f":"IFERROR(Scenarios!BF17,\"\")","v":0},{"$f":"IFERROR(Scenarios!BG17,\"\")","v":0},{"$f":"IFERROR(Scenarios!BH17,\"\")","v":0},{"$f":"IFERROR(Scenarios!BI17,\"\")","v":0},{"$f":"IFERROR(Scenarios!BJ17,\"\")","v":0},{"$f":"IFERROR(Scenarios!BK17,\"\")","v":0},{"$f":"IFERROR(Scenarios!BL17,\"\")","v":0},{"$f":"IFERROR(Scenarios!BM17,\"\")","v":0},{"$f":"IFERROR(Scenarios!BN17,\"\")","v":0},{"$f":"IFERROR(Scenarios!BO17,\"\")","v":0},{"$f":"IFERROR(Scenarios!BP17,\"\")","v":0},{"$f":"IFERROR(Scenarios!BQ17,\"\")","v":0},{"$f":"IFERROR(Scenarios!BR17,\"\")","v":0},{"$f":"IFERROR(Scenarios!BS17,\"\")","v":0},{"$f":"IFERROR(Scenarios!BT17,\"\")","v":0},{"$f":"IFERROR(Scenarios!BU17,\"\")","v":0},{"$f":"IFERROR(Scenarios!BV17,\"\")","v":0},{"$f":"IFERROR(Scenarios!BW17,\"\")","v":0},{"$f":"IFERROR(Scenarios!BX17,\"\")","v":0},{"$f":"IFERROR(Scenarios!BY17,\"\")","v":0},{"$f":"IFERROR(Scenarios!BZ17,\"\")","v":0},{"$f":"IFERROR(Scenarios!CA17,\"\")","v":0},{"$f":"IFERROR(Scenarios!CB17,\"\")","v":0},{"$f":"IFERROR(Scenarios!CC17,\"\")","v":0},{"$f":"IFERROR(Scenarios!CD17,\"\")","v":0},{"$f":"IFERROR(Scenarios!CE17,\"\")","v":0},{"$f":"IFERROR(Scenarios!CF17,\"\")","v":0},{"$f":"IFERROR(Scenarios!CG17,\"\")","v":0},{"$f":"IFERROR(Scenarios!CH17,\"\")","v":0},{"$f":"IFERROR(Scenarios!CI17,\"\")","v":0},{"$f":"IFERROR(Scenarios!CJ17,\"\")","v":0},{"$f":"IFERROR(Scenarios!CK17,\"\")","v":0},{"$f":"IFERROR(Scenarios!CL17,\"\")","v":0},{"$f":"IFERROR(Scenarios!CM17,\"\")","v":0},{"$f":"IFERROR(Scenarios!CN17,\"\")","v":0},{"$f":"IFERROR(Scenarios!CO17,\"\")","v":0},{"$f":"IFERROR(Scenarios!CP17,\"\")","v":0},{"$f":"IFERROR(Scenarios!CQ17,\"\")","v":0},{"$f":"IFERROR(Scenarios!CR17,\"\")","v":0},{"$f":"IFERROR(Scenarios!CS17,\"\")","v":0},{"$f":"IFERROR(Scenarios!CT17,\"\")","v":0},{"$f":"IFERROR(Scenarios!CU17,\"\")","v":0},{"$f":"IFERROR(Scenarios!CV17,\"\")","v":0},{"$f":"IFERROR(Scenarios!CW17,\"\")","v":0},{"$f":"IFERROR(Scenarios!CX17,\"\")","v":0},{"$f":"IFERROR(Scenarios!CY17,\"\")","v":0},{"$f":"IFERROR(Scenarios!CZ17,\"\")","v":0},{"$f":"IFERROR(Scenarios!DA17,\"\")","v":0}]
[{"$f":"IFERROR(Scenarios!A18,\"\")","v":0},{"$f":"IFERROR(Scenarios!B18,\"\")","v":0},{"$f":"IFERROR(Scenarios!C18,\"\")","v":0},{"$f":"IFERROR(Scenarios!D18,\"\")","v":0},{"$f":"IFERROR(Scenarios!E18,\"\")","v":0},{"$f":"IFERROR(Scenarios!F18,\"\")","v":0},{"$f":"IFERROR(Scenarios!G18,\"\")","v":0},{"$f":"IFERROR(Scenarios!H18,\"\")","v":0},{"$f":"IFERROR(Scenarios!I18,\"\")","v":0},{"$f":"IFERROR(Scenarios!J18,\"\")","v":0},{"$f":"IFERROR(Scenarios!K18,\"\")","v":0},{"$f":"IFERROR(Scenarios!L18,\"\")","v":0},{"$f":"IFERROR(Scenarios!M18,\"\")","v":0},{"$f":"IFERROR(Scenarios!N18,\"\")","v":0},{"$f":"IFERROR(Scenarios!O18,\"\")","v":0},{"$f":"IFERROR(Scenarios!P18,\"\")","v":0},{"$f":"IFERROR(Scenarios!Q18,\"\")","v":0},{"$f":"IFERROR(Scenarios!R18,\"\")","v":0},{"$f":"IFERROR(Scenarios!S18,\"\")","v":0},{"$f":"IFERROR(Scenarios!T18,\"\")","v":0},{"$f":"IFERROR(Scenarios!U18,\"\")","v":0},{"$f":"IFERROR(Scenarios!V18,\"\")","v":0},{"$f":"IFERROR(Scenarios!W18,\"\")","v":0},{"$f":"IFERROR(Scenarios!X18,\"\")","v":0},{"$f":"IFERROR(Scenarios!Y18,\"\")","v":0},{"$f":"IFERROR(Scenarios!Z18,\"\")","v":0},{"$f":"IFERROR(Scenarios!AA18,\"\")","v":0},{"$f":"IFERROR(Scenarios!AB18,\"\")","v":0},{"$f":"IFERROR(Scenarios!AC18,\"\")","v":0},{"$f":"IFERROR(Scenarios!AD18,\"\")","v":0},{"$f":"IFERROR(Scenarios!AE18,\"\")","v":0},{"$f":"IFERROR(Scenarios!AF18,\"\")","v":0},{"$f":"IFERROR(Scenarios!AG18,\"\")","v":0},{"$f":"IFERROR(Scenarios!AH18,\"\")","v":0},{"$f":"IFERROR(Scenarios!AI18,\"\")","v":0},{"$f":"IFERROR(Scenarios!AJ18,\"\")","v":0},{"$f":"IFERROR(Scenarios!AK18,\"\")","v":0},{"$f":"IFERROR(Scenarios!AL18,\"\")","v":0},{"$f":"IFERROR(Scenarios!AM18,\"\")","v":0},{"$f":"IFERROR(Scenarios!AN18,\"\")","v":0},{"$f":"IFERROR(Scenarios!AO18,\"\")","v":0},{"$f":"IFERROR(Scenarios!AP18,\"\")","v":0},{"$f":"IFERROR(Scenarios!AQ18,\"\")","v":0},{"$f":"IFERROR(Scenarios!AR18,\"\")","v":0},{"$f":"IFERROR(Scenarios!AS18,\"\")","v":0},{"$f":"IFERROR(Scenarios!AT18,\"\")","v":0},{"$f":"IFERROR(Scenarios!AU18,\"\")","v":0},{"$f":"IFERROR(Scenarios!AV18,\"\")","v":0},{"$f":"IFERROR(Scenarios!AW18,\"\")","v":0},{"$f":"IFERROR(Scenarios!AX18,\"\")","v":0},{"$f":"IFERROR(Scenarios!AY18,\"\")","v":0},{"$f":"IFERROR(Scenarios!AZ18,\"\")","v":0},{"$f":"IFERROR(Scenarios!BA18,\"\")","v":0},{"$f":"IFERROR(Scenarios!BB18,\"\")","v":0},{"$f":"IFERROR(Scenarios!BC18,\"\")","v":0},{"$f":"IFERROR(Scenarios!BD18,\"\")","v":0},{"$f":"IFERROR(Scenarios!BE18,\"\")","v":0},{"$f":"IFERROR(Scenarios!BF18,\"\")","v":0},{"$f":"IFERROR(Scenarios!BG18,\"\")","v":0},{"$f":"IFERROR(Scenarios!BH18,\"\")","v":0},{"$f":"IFERROR(Scenarios!BI18,\"\")","v":0},{"$f":"IFERROR(Scenarios!BJ18,\"\")","v":0},{"$f":"IFERROR(Scenarios!BK18,\"\")","v":0},{"$f":"IFERROR(Scenarios!BL18,\"\")","v":0},{"$f":"IFERROR(Scenarios!BM18,\"\")","v":0},{"$f":"IFERROR(Scenarios!BN18,\"\")","v":0},{"$f":"IFERROR(Scenarios!BO18,\"\")","v":0},{"$f":"IFERROR(Scenarios!BP18,\"\")","v":0},{"$f":"IFERROR(Scenarios!BQ18,\"\")","v":0},{"$f":"IFERROR(Scenarios!BR18,\"\")","v":0},{"$f":"IFERROR(Scenarios!BS18,\"\")","v":0},{"$f":"IFERROR(Scenarios!BT18,\"\")","v":0},{"$f":"IFERROR(Scenarios!BU18,\"\")","v":0},{"$f":"IFERROR(Scenarios!BV18,\"\")","v":0},{"$f":"IFERROR(Scenarios!BW18,\"\")","v":0},{"$f":"IFERROR(Scenarios!BX18,\"\")","v":0},{"$f":"IFERROR(Scenarios!BY18,\"\")","v":0},{"$f":"IFERROR(Scenarios!BZ18,\"\")","v":0},{"$f":"IFERROR(Scenarios!CA18,\"\")","v":0},{"$f":"IFERROR(Scenarios!CB18,\"\")","v":0},{"$f":"IFERROR(Scenarios!CC18,\"\")","v":0},{"$f":"IFERROR(Scenarios!CD18,\"\")","v":0},{"$f":"IFERROR(Scenarios!CE18,\"\")","v":0},{"$f":"IFERROR(Scenarios!CF18,\"\")","v":0},{"$f":"IFERROR(Scenarios!CG18,\"\")","v":0},{"$f":"IFERROR(Scenarios!CH18,\"\")","v":0},{"$f":"IFERROR(Scenarios!CI18,\"\")","v":0},{"$f":"IFERROR(Scenarios!CJ18,\"\")","v":0},{"$f":"IFERROR(Scenarios!CK18,\"\")","v":0},{"$f":"IFERROR(Scenarios!CL18,\"\")","v":0},{"$f":"IFERROR(Scenarios!CM18,\"\")","v":0},{"$f":"IFERROR(Scenarios!CN18,\"\")","v":0},{"$f":"IFERROR(Scenarios!CO18,\"\")","v":0},{"$f":"IFERROR(Scenarios!CP18,\"\")","v":0},{"$f":"IFERROR(Scenarios!CQ18,\"\")","v":0},{"$f":"IFERROR(Scenarios!CR18,\"\")","v":0},{"$f":"IFERROR(Scenarios!CS18,\"\")","v":0},{"$f":"IFERROR(Scenarios!CT18,\"\")","v":0},{"$f":"IFERROR(Scenarios!CU18,\"\")","v":0},{"$f":"IFERROR(Scenarios!CV18,\"\")","v":0},{"$f":"IFERROR(Scenarios!CW18,\"\")","v":0},{"$f":"IFERROR(Scenarios!CX18,\"\")","v":0},{"$f":"IFERROR(Scenarios!CY18,\"\")","v":0},{"$f":"IFERROR(Scenarios!CZ18,\"\")","v":0},{"$f":"IFERROR(Scenarios!DA18,\"\")","v":0}]
[{"$f":"IFERROR(Scenarios!A19,\"\")","v":0},{"$f":"IFERROR(Scenarios!B19,\"\")","v":0},{"$f":"IFERROR(Scenarios!C19,\"\")","v":0},{"$f":"IFERROR(Scenarios!D19,\"\")","v":0},{"$f":"IFERROR(Scenarios!E19,\"\")","v":0},{"$f":"IFERROR(Scenarios!F19,\"\")","v":0},{"$f":"IFERROR(Scenarios!G19,\"\")","v":0},{"$f":"IFERROR(Scenarios!H19,\"\")","v":0},{"$f":"IFERROR(Scenarios!I19,\"\")","v":0},{"$f":"IFERROR(Scenarios!J19,\"\")","v":0},{"$f":"IFERROR(Scenarios!K19,\"\")","v":0},{"$f":"IFERROR(Scenarios!L19,\"\")","v":0},{"$f":"IFERROR(Scenarios!M19,\"\")","v":0},{"$f":"IFERROR(Scenarios!N19,\"\")","v":0},{"$f":"IFERROR(Scenarios!O19,\"\")","v":0},{"$f":"IFERROR(Scenarios!P19,\"\")","v":0},{"$f":"IFERROR(Scenarios!Q19,\"\")","v":0},{"$f":"IFERROR(Scenarios!R19,\"\")","v":0},{"$f":"IFERROR(Scenarios!S19,\"\")","v":0},{"$f":"IFERROR(Scenarios!T19,\"\")","v":0},{"$f":"IFERROR(Scenarios!U19,\"\")","v":0},{"$f":"IFERROR(Scenarios!V19,\"\")","v":0},{"$f":"IFERROR(Scenarios!W19,\"\")","v":0},{"$f":"IFERROR(Scenarios!X19,\"\")","v":0},{"$f":"IFERROR(Scenarios!Y19,\"\")","v":0},{"$f":"IFERROR(Scenarios!Z19,\"\")","v":0},{"$f":"IFERROR(Scenarios!AA19,\"\")","v":0},{"$f":"IFERROR(Scenarios!AB19,\"\")","v":0},{"$f":"IFERROR(Scenarios!AC19,\"\")","v":0},{"$f":"IFERROR(Scenarios!AD19,\"\")","v":0},{"$f":"IFERROR(Scenarios!AE19,\"\")","v":0},{"$f":"IFERROR(Scenarios!AF19,\"\")","v":0},{"$f":"IFERROR(Scenarios!AG19,\"\")","v":0},{"$f":"IFERROR(Scenarios!AH19,\"\")","v":0},{"$f":"IFERROR(Scenarios!AI19,\"\")","v":0},{"$f":"IFERROR(Scenarios!AJ19,\"\")","v":0},{"$f":"IFERROR(Scenarios!AK19,\"\")","v":0},{"$f":"IFERROR(Scenarios!AL19,\"\")","v":0},{"$f":"IFERROR(Scenarios!AM19,\"\")","v":0},{"$f":"IFERROR(Scenarios!AN19,\"\")","v":0},{"$f":"IFERROR(Scenarios!AO19,\"\")","v":0},{"$f":"IFERROR(Scenarios!AP19,\"\")","v":0},{"$f":"IFERROR(Scenarios!AQ19,\"\")","v":0},{"$f":"IFERROR(Scenarios!AR19,\"\")","v":0},{"$f":"IFERROR(Scenarios!AS19,\"\")","v":0},{"$f":"IFERROR(Scenarios!AT19,\"\")","v":0},{"$f":"IFERROR(Scenarios!AU19,\"\")","v":0},{"$f":"IFERROR(Scenarios!AV19,\"\")","v":0},{"$f":"IFERROR(Scenarios!AW19,\"\")","v":0},{"$f":"IFERROR(Scenarios!AX19,\"\")","v":0},{"$f":"IFERROR(Scenarios!AY19,\"\")","v":0},{"$f":"IFERROR(Scenarios!AZ19,\"\")","v":0},{"$f":"IFERROR(Scenarios!BA19,\"\")","v":0},{"$f":"IFERROR(Scenarios!BB19,\"\")","v":0},{"$f":"IFERROR(Scenarios!BC19,\"\")","v":0},{"$f":"IFERROR(Scenarios!BD19,\"\")","v":0},{"$f":"IFERROR(Scenarios!BE19,\"\")","v":0},{"$f":"IFERROR(Scenarios!BF19,\"\")","v":0},{"$f":"IFERROR(Scenarios!BG19,\"\")","v":0},{"$f":"IFERROR(Scenarios!BH19,\"\")","v":0},{"$f":"IFERROR(Scenarios!BI19,\"\")","v":0},{"$f":"IFERROR(Scenarios!BJ19,\"\")","v":0},{"$f":"IFERROR(Scenarios!BK19,\"\")","v":0},{"$f":"IFERROR(Scenarios!BL19,\"\")","v":0},{"$f":"IFERROR(Scenarios!BM19,\"\")","v":0},{"$f":"IFERROR(Scenarios!BN19,\"\")","v":0},{"$f":"IFERROR(Scenarios!BO19,\"\")","v":0},{"$f":"IFERROR(Scenarios!BP19,\"\")","v":0},{"$f":"IFERROR(Scenarios!BQ19,\"\")","v":0},{"$f":"IFERROR(Scenarios!BR19,\"\")","v":0},{"$f":"IFERROR(Scenarios!BS19,\"\")","v":0},{"$f":"IFERROR(Scenarios!BT19,\"\")","v":0},{"$f":"IFERROR(Scenarios!BU19,\"\")","v":0},{"$f":"IFERROR(Scenarios!BV19,\"\")","v":0},{"$f":"IFERROR(Scenarios!BW19,\"\")","v":0},{"$f":"IFERROR(Scenarios!BX19,\"\")","v":0},{"$f":"IFERROR(Scenarios!BY19,\"\")","v":0},{"$f":"IFERROR(Scenarios!BZ19,\"\")","v":0},{"$f":"IFERROR(Scenarios!CA19,\"\")","v":0},{"$f":"IFERROR(Scenarios!CB19,\"\")","v":0},{"$f":"IFERROR(Scenarios!CC19,\"\")","v":0},{"$f":"IFERROR(Scenarios!CD19,\"\")","v":0},{"$f":"IFERROR(Scenarios!CE19,\"\")","v":0},{"$f":"IFERROR(Scenarios!CF19,\"\")","v":0},{"$f":"IFERROR(Scenarios!CG19,\"\")","v":0},{"$f":"IFERROR(Scenarios!CH19,\"\")","v":0},{"$f":"IFERROR(Scenarios!CI19,\"\")","v":0},{"$f":"IFERROR(Scenarios!CJ19,\"\")","v":0},{"$f":"IFERROR(Scenarios!CK19,\"\")","v":0},{"$f":"IFERROR(Scenarios!CL19,\"\")","v":0},{"$f":"IFERROR(Scenarios!CM19,\"\")","v":0},{"$f":"IFERROR(Scenarios!CN19,\"\")","v":0},{"$f":"IFERROR(Scenarios!CO19,\"\")","v":0},{"$f":"IFERROR(Scenarios!CP19,\"\")","v":0},{"$f":"IFERROR(Scenarios!CQ19,\"\")","v":0},{"$f":"IFERROR(Scenarios!CR19,\"\")","v":0},{"$f":"IFERROR(Scenarios!CS19,\"\")","v":0},{"$f":"IFERROR(Scenarios!CT19,\"\")","v":0},{"$f":"IFERROR(Scenarios!CU19,\"\")","v":0},{"$f":"IFERROR(Scenarios!CV19,\"\")","v":0},{"$f":"IFERROR(Scenarios!CW19,\"\")","v":0},{"$f":"IFERROR(Scenarios!CX19,\"\")","v":0},{"$f":"IFERROR(Scenarios!CY19,\"\")","v":0},{"$f":"IFERROR(Scenarios!CZ19,\"\")","v":0},{"$f":"IFERROR(Scenarios!DA19,\"\")","v":0}]
[{"$f":"IFERROR(Scenarios!A20,\"\")","v":0},{"$f":"IFERROR(Scenarios!B20,\"\")","v":0},{"$f":"IFERROR(Scenarios!C20,\"\")","v":0},{"$f":"IFERROR(Scenarios!D20,\"\")","v":0},{"$f":"IFERROR(Scenarios!E20,\"\")","v":0},{"$f":"IFERROR(Scenarios!F20,\"\")","v":0},{"$f":"IFERROR(Scenarios!G20,\"\")","v":0},{"$f":"IFERROR(Scenarios!H20,\"\")","v":0},{"$f":"IFERROR(Scenarios!I20,\"\")","v":0},{"$f":"IFERROR(Scenarios!J20,\"\")","v":0},{"$f":"IFERROR(Scenarios!K20,\"\")","v":0},{"$f":"IFERROR(Scenarios!L20,\"\")","v":0},{"$f":"IFERROR(Scenarios!M20,\"\")","v":0},{"$f":"IFERROR(Scenarios!N20,\"\")","v":0},{"$f":"IFERROR(Scenarios!O20,\"\")","v":0},{"$f":"IFERROR(Scenarios!P20,\"\")","v":0},{"$f":"IFERROR(Scenarios!Q20,\"\")","v":0},{"$f":"IFERROR(Scenarios!R20,\"\")","v":0},{"$f":"IFERROR(Scenarios!S20,\"\")","v":0},{"$f":"IFERROR(Scenarios!T20,\"\")","v":0},{"$f":"IFERROR(Scenarios!U20,\"\")","v":0},{"$f":"IFERROR(Scenarios!V20,\"\")","v":0},{"$f":"IFERROR(Scenarios!W20,\"\")","v":0},{"$f":"IFERROR(Scenarios!X20,\"\")","v":0},{"$f":"IFERROR(Scenarios!Y20,\"\")","v":0},{"$f":"IFERROR(Scenarios!Z20,\"\")","v":0},{"$f":"IFERROR(Scenarios!AA20,\"\")","v":0},{"$f":"IFERROR(Scenarios!AB20,\"\")","v":0},{"$f":"IFERROR(Scenarios!AC20,\"\")","v":0},{"$f":"IFERROR(Scenarios!AD20,\"\")","v":0},{"$f":"IFERROR(Scenarios!AE20,\"\")","v":0},{"$f":"IFERROR(Scenarios!AF20,\"\")","v":0},{"$f":"IFERROR(Scenarios!AG20,\"\")","v":0},{"$f":"IFERROR(Scenarios!AH20,\"\")","v":0},{"$f":"IFERROR(Scenarios!AI20,\"\")","v":0},{"$f":"IFERROR(Scenarios!AJ20,\"\")","v":0},{"$f":"IFERROR(Scenarios!AK20,\"\")","v":0},{"$f":"IFERROR(Scenarios!AL20,\"\")","v":0},{"$f":"IFERROR(Scenarios!AM20,\"\")","v":0},{"$f":"IFERROR(Scenarios!AN20,\"\")","v":0},{"$f":"IFERROR(Scenarios!AO20,\"\")","v":0},{"$f":"IFERROR(Scenarios!AP20,\"\")","v":0},{"$f":"IFERROR(Scenarios!AQ20,\"\")","v":0},{"$f":"IFERROR(Scenarios!AR20,\"\")","v":0},{"$f":"IFERROR(Scenarios!AS20,\"\")","v":0},{"$f":"IFERROR(Scenarios!AT20,\"\")","v":0},{"$f":"IFERROR(Scenarios!AU20,\"\")","v":0},{"$f":"IFERROR(Scenarios!AV20,\"\")","v":0},{"$f":"IFERROR(Scenarios!AW20,\"\")","v":0},{"$f":"IFERROR(Scenarios!AX20,\"\")","v":0},{"$f":"IFERROR(Scenarios!AY20,\"\")","v":0},{"$f":"IFERROR(Scenarios!AZ20,\"\")","v":0},{"$f":"IFERROR(Scenarios!BA20,\"\")","v":0},{"$f":"IFERROR(Scenarios!BB20,\"\")","v":0},{"$f":"IFERROR(Scenarios!BC20,\"\")","v":0},{"$f":"IFERROR(Scenarios!BD20,\"\")","v":0},{"$f":"IFERROR(Scenarios!BE20,\"\")","v":0},{"$f":"IFERROR(Scenarios!BF20,\"\")","v":0},{"$f":"IFERROR(Scenarios!BG20,\"\")","v":0},{"$f":"IFERROR(Scenarios!BH20,\"\")","v":0},{"$f":"IFERROR(Scenarios!BI20,\"\")","v":0},{"$f":"IFERROR(Scenarios!BJ20,\"\")","v":0},{"$f":"IFERROR(Scenarios!BK20,\"\")","v":0},{"$f":"IFERROR(Scenarios!BL20,\"\")","v":0},{"$f":"IFERROR(Scenarios!BM20,\"\")","v":0},{"$f":"IFERROR(Scenarios!BN20,\"\")","v":0},{"$f":"IFERROR(Scenarios!BO20,\"\")","v":0},{"$f":"IFERROR(Scenarios!BP20,\"\")","v":0},{"$f":"IFERROR(Scenarios!BQ20,\"\")","v":0},{"$f":"IFERROR(Scenarios!BR20,\"\")","v":0},{"$f":"IFERROR(Scenarios!BS20,\"\")","v":0},{"$f":"IFERROR(Scenarios!BT20,\"\")","v":0},{"$f":"IFERROR(Scenarios!BU20,\"\")","v":0},{"$f":"IFERROR(Scenarios!BV20,\"\")","v":0},{"$f":"IFERROR(Scenarios!BW20,\"\")","v":0},{"$f":"IFERROR(Scenarios!BX20,\"\")","v":0},{"$f":"IFERROR(Scenarios!BY20,\"\")","v":0},{"$f":"IFERROR(Scenarios!BZ20,\"\")","v":0},{"$f":"IFERROR(Scenarios!CA20,\"\")","v":0},{"$f":"IFERROR(Scenarios!CB20,\"\")","v":0},{"$f":"IFERROR(Scenarios!CC20,\"\")","v":0},{"$f":"IFERROR(Scenarios!CD20,\"\")","v":0},{"$f":"IFERROR(Scenarios!CE20,\"\")","v":0},{"$f":"IFERROR(Scenarios!CF20,\"\")","v":0},{"$f":"IFERROR(Scenarios!CG20,\"\")","v":0},{"$f":"IFERROR(Scenarios!CH20,\"\")","v":0},{"$f":"IFERROR(Scenarios!CI20,\"\")","v":0},{"$f":"IFERROR(Scenarios!CJ20,\"\")","v":0},{"$f":"IFERROR(Scenarios!CK20,\"\")","v":0},{"$f":"IFERROR(Scenarios!CL20,\"\")","v":0},{"$f":"IFERROR(Scenarios!CM20,\"\")","v":0},{"$f":"IFERROR(Scenarios!CN20,\"\")","v":0},{"$f":"IFERROR(Scenarios!CO20,\"\")","v":0},{"$f":"IFERROR(Scenarios!CP20,\"\")","v":0},{"$f":"IFERROR(Scenarios!CQ20,\"\")","v":0},{"$f":"IFERROR(Scenarios!CR20,\"\")","v":0},{"$f":"IFERROR(Scenarios!CS20,\"\")","v":0},{"$f":"IFERROR(Scenarios!CT20,\"\")","v":0},{"$f":"IFERROR(Scenarios!CU20,\"\")","v":0},{"$f":"IFERROR(Scenarios!CV20,\"\")","v":0},{"$f":"IFERROR(Scenarios!CW20,\"\")","v":0},{"$f":"IFERROR(Scenarios!CX20,\"\")","v":0},{"$f":"IFERROR(Scenarios!CY20,\"\")","v":0},{"$f":"IFERROR(Scenarios!CZ20,\"\")","v":0},{"$f":"IFERROR(Scenarios!DA20,\"\")","v":0}]
[{"$f":"IFERROR(Scenarios!A21,\"\")","v":0},{"$f":"IFERROR(Scenarios!B21,\"\")","v":0},{"$f":"IFERROR(Scenarios!C21,\"\")","v":0},{"$f":"IFERROR(Scenarios!D21,\"\")","v":0},{"$f":"IFERROR(Scenarios!E21,\"\")","v":0},{"$f":"IFERROR(Scenarios!F21,\"\")","v":0},{"$f":"IFERROR(Scenarios!G21,\"\")","v":0},{"$f":"IFERROR(Scenarios!H21,\"\")","v":0},{"$f":"IFERROR(Scenarios!I21,\"\")","v":0},{"$f":"IFERROR(Scenarios!J21,\"\")","v":0},{"$f":"IFERROR(Scenarios!K21,\"\")","v":0},{"$f":"IFERROR(Scenarios!L21,\"\")","v":0},{"$f":"IFERROR(Scenarios!M21,\"\")","v":0},{"$f":"IFERROR(Scenarios!N21,\"\")","v":0},{"$f":"IFERROR(Scenarios!O21,\"\")","v":0},{"$f":"IFERROR(Scenarios!P21,\"\")","v":0},{"$f":"IFERROR(Scenarios!Q21,\"\")","v":0},{"$f":"IFERROR(Scenarios!R21,\"\")","v":0},{"$f":"IFERROR(Scenarios!S21,\"\")","v":0},{"$f":"IFERROR(Scenarios!T21,\"\")","v":0},{"$f":"IFERROR(Scenarios!U21,\"\")","v":0},{"$f":"IFERROR(Scenarios!V21,\"\")","v":0},{"$f":"IFERROR(Scenarios!W21,\"\")","v":0},{"$f":"IFERROR(Scenarios!X21,\"\")","v":0},{"$f":"IFERROR(Scenarios!Y21,\"\")","v":0},{"$f":"IFERROR(Scenarios!Z21,\"\")","v":0},{"$f":"IFERROR(Scenarios!AA21,\"\")","v":0},{"$f":"IFERROR(Scenarios!AB21,\"\")","v":0},{"$f":"IFERROR(Scenarios!AC21,\"\")","v":0},{"$f":"IFERROR(Scenarios!AD21,\"\")","v":0},{"$f":"IFERROR(Scenarios!AE21,\"\")","v":0},{"$f":"IFERROR(Scenarios!AF21,\"\")","v":0},{"$f":"IFERROR(Scenarios!AG21,\"\")","v":0},{"$f":"IFERROR(Scenarios!AH21,\"\")","v":0},{"$f":"IFERROR(Scenarios!AI21,\"\")","v":0},{"$f":"IFERROR(Scenarios!AJ21,\"\")","v":0},{"$f":"IFERROR(Scenarios!AK21,\"\")","v":0},{"$f":"IFERROR(Scenarios!AL21,\"\")","v":0},{"$f":"IFERROR(Scenarios!AM21,\"\")","v":0},{"$f":"IFERROR(Scenarios!AN21,\"\")","v":0},{"$f":"IFERROR(Scenarios!AO21,\"\")","v":0},{"$f":"IFERROR(Scenarios!AP21,\"\")","v":0},{"$f":"IFERROR(Scenarios!AQ21,\"\")","v":0},{"$f":"IFERROR(Scenarios!AR21,\"\")","v":0},{"$f":"IFERROR(Scenarios!AS21,\"\")","v":0},{"$f":"IFERROR(Scenarios!AT21,\"\")","v":0},{"$f":"IFERROR(Scenarios!AU21,\"\")","v":0},{"$f":"IFERROR(Scenarios!AV21,\"\")","v":0},{"$f":"IFERROR(Scenarios!AW21,\"\")","v":0},{"$f":"IFERROR(Scenarios!AX21,\"\")","v":0},{"$f":"IFERROR(Scenarios!AY21,\"\")","v":0},{"$f":"IFERROR(Scenarios!AZ21,\"\")","v":0},{"$f":"IFERROR(Scenarios!BA21,\"\")","v":0},{"$f":"IFERROR(Scenarios!BB21,\"\")","v":0},{"$f":"IFERROR(Scenarios!BC21,\"\")","v":0},{"$f":"IFERROR(Scenarios!BD21,\"\")","v":0},{"$f":"IFERROR(Scenarios!BE21,\"\")","v":0},{"$f":"IFERROR(Scenarios!BF21,\"\")","v":0},{"$f":"IFERROR(Scenarios!BG21,\"\")","v":0},{"$f":"IFERROR(Scenarios!BH21,\"\")","v":0},{"$f":"IFERROR(Scenarios!BI21,\"\")","v":0},{"$f":"IFERROR(Scenarios!BJ21,\"\")","v":0},{"$f":"IFERROR(Scenarios!BK21,\"\")","v":0},{"$f":"IFERROR(Scenarios!BL21,\"\")","v":0},{"$f":"IFERROR(Scenarios!BM21,\"\")","v":0},{"$f":"IFERROR(Scenarios!BN21,\"\")","v":0},{"$f":"IFERROR(Scenarios!BO21,\"\")","v":0},{"$f":"IFERROR(Scenarios!BP21,\"\")","v":0},{"$f":"IFERROR(Scenarios!BQ21,\"\")","v":0},{"$f":"IFERROR(Scenarios!BR21,\"\")","v":0},{"$f":"IFERROR(Scenarios!BS21,\"\")","v":0},{"$f":"IFERROR(Scenarios!BT21,\"\")","v":0},{"$f":"IFERROR(Scenarios!BU21,\"\")","v":0},{"$f":"IFERROR(Scenarios!BV21,\"\")","v":0},{"$f":"IFERROR(Scenarios!BW21,\"\")","v":0},{"$f":"IFERROR(Scenarios!BX21,\"\")","v":0},{"$f":"IFERROR(Scenarios!BY21,\"\")","v":0},{"$f":"IFERROR(Scenarios!BZ21,\"\")","v":0},{"$f":"IFERROR(Scenarios!CA21,\"\")","v":0},{"$f":"IFERROR(Scenarios!CB21,\"\")","v":0},{"$f":"IFERROR(Scenarios!CC21,\"\")","v":0},{"$f":"IFERROR(Scenarios!CD21,\"\")","v":0},{"$f":"IFERROR(Scenarios!CE21,\"\")","v":0},{"$f":"IFERROR(Scenarios!CF21,\"\")","v":0},{"$f":"IFERROR(Scenarios!CG21,\"\")","v":0},{"$f":"IFERROR(Scenarios!CH21,\"\")","v":0},{"$f":"IFERROR(Scenarios!CI21,\"\")","v":0},{"$f":"IFERROR(Scenarios!CJ21,\"\")","v":0},{"$f":"IFERROR(Scenarios!CK21,\"\")","v":0},{"$f":"IFERROR(Scenarios!CL21,\"\")","v":0},{"$f":"IFERROR(Scenarios!CM21,\"\")","v":0},{"$f":"IFERROR(Scenarios!CN21,\"\")","v":0},{"$f":"IFERROR(Scenarios!CO21,\"\")","v":0},{"$f":"IFERROR(Scenarios!CP21,\"\")","v":0},{"$f":"IFERROR(Scenarios!CQ21,\"\")","v":0},{"$f":"IFERROR(Scenarios!CR21,\"\")","v":0},{"$f":"IFERROR(Scenarios!CS21,\"\")","v":0},{"$f":"IFERROR(Scenarios!CT21,\"\")","v":0},{"$f":"IFERROR(Scenarios!CU21,\"\")","v":0},{"$f":"IFERROR(Scenarios!CV21,\"\")","v":0},{"$f":"IFERROR(Scenarios!CW21,\"\")","v":0},{"$f":"IFERROR(Scenarios!CX21,\"\")","v":0},{"$f":"IFERROR(Scenarios!CY21,\"\")","v":0},{"$f":"IFERROR(Scenarios!CZ21,\"\")","v":0},{"$f":"IFERROR(Scenarios!DA21,\"\")","v":0}]
[{"$f":"IFERROR(Scenarios!A22,\"\")","v":0},{"$f":"IFERROR(Scenarios!B22,\"\")","v":0},{"$f":"IFERROR(Scenarios!C22,\"\")","v":0},{"$f":"IFERROR(Scenarios!D22,\"\")","v":0},{"$f":"IFERROR(Scenarios!E22,\"\")","v":0},{"$f":"IFERROR(Scenarios!F22,\"\")","v":0},{"$f":"IFERROR(Scenarios!G22,\"\")","v":0},{"$f":"IFERROR(Scenarios!H22,\"\")","v":0},{"$f":"IFERROR(Scenarios!I22,\"\")","v":0},{"$f":"IFERROR(Scenarios!J22,\"\")","v":0},{"$f":"IFERROR(Scenarios!K22,\"\")","v":0},{"$f":"IFERROR(Scenarios!L22,\"\")","v":0},{"$f":"IFERROR(Scenarios!M22,\"\")","v":0},{"$f":"IFERROR(Scenarios!N22,\"\")","v":0},{"$f":"IFERROR(Scenarios!O22,\"\")","v":0},{"$f":"IFERROR(Scenarios!P22,\"\")","v":0},{"$f":"IFERROR(Scenarios!Q22,\"\")","v":0},{"$f":"IFERROR(Scenarios!R22,\"\")","v":0},{"$f":"IFERROR(Scenarios!S22,\"\")","v":0},{"$f":"IFERROR(Scenarios!T22,\"\")","v":0},{"$f":"IFERROR(Scenarios!U22,\"\")","v":0},{"$f":"IFERROR(Scenarios!V22,\"\")","v":0},{"$f":"IFERROR(Scenarios!W22,\"\")","v":0},{"$f":"IFERROR(Scenarios!X22,\"\")","v":0},{"$f":"IFERROR(Scenarios!Y22,\"\")","v":0},{"$f":"IFERROR(Scenarios!Z22,\"\")","v":0},{"$f":"IFERROR(Scenarios!AA22,\"\")","v":0},{"$f":"IFERROR(Scenarios!AB22,\"\")","v":0},{"$f":"IFERROR(Scenarios!AC22,\"\")","v":0},{"$f":"IFERROR(Scenarios!AD22,\"\")","v":0},{"$f":"IFERROR(Scenarios!AE22,\"\")","v":0},{"$f":"IFERROR(Scenarios!AF22,\"\")","v":0},{"$f":"IFERROR(Scenarios!AG22,\"\")","v":0},{"$f":"IFERROR(Scenarios!AH22,\"\")","v":0},{"$f":"IFERROR(Scenarios!AI22,\"\")","v":0},{"$f":"IFERROR(Scenarios!AJ22,\"\")","v":0},{"$f":"IFERROR(Scenarios!AK22,\"\")","v":0},{"$f":"IFERROR(Scenarios!AL22,\"\")","v":0},{"$f":"IFERROR(Scenarios!AM22,\"\")","v":0},{"$f":"IFERROR(Scenarios!AN22,\"\")","v":0},{"$f":"IFERROR(Scenarios!AO22,\"\")","v":0},{"$f":"IFERROR(Scenarios!AP22,\"\")","v":0},{"$f":"IFERROR(Scenarios!AQ22,\"\")","v":0},{"$f":"IFERROR(Scenarios!AR22,\"\")","v":0},{"$f":"IFERROR(Scenarios!AS22,\"\")","v":0},{"$f":"IFERROR(Scenarios!AT22,\"\")","v":0},{"$f":"IFERROR(Scenarios!AU22,\"\")","v":0},{"$f":"IFERROR(Scenarios!AV22,\"\")","v":0},{"$f":"IFERROR(Scenarios!AW22,\"\")","v":0},{"$f":"IFERROR(Scenarios!AX22,\"\")","v":0},{"$f":"IFERROR(Scenarios!AY22,\"\")","v":0},{"$f":"IFERROR(Scenarios!AZ22,\"\")","v":0},{"$f":"IFERROR(Scenarios!BA22,\"\")","v":0},{"$f":"IFERROR(Scenarios!BB22,\"\")","v":0},{"$f":"IFERROR(Scenarios!BC22,\"\")","v":0},{"$f":"IFERROR(Scenarios!BD22,\"\")","v":0},{"$f":"IFERROR(Scenarios!BE22,\"\")","v":0},{"$f":"IFERROR(Scenarios!BF22,\"\")","v":0},{"$f":"IFERROR(Scenarios!BG22,\"\")","v":0},{"$f":"IFERROR(Scenarios!BH22,\"\")","v":0},{"$f":"IFERROR(Scenarios!BI22,\"\")","v":0},{"$f":"IFERROR(Scenarios!BJ22,\"\")","v":0},{"$f":"IFERROR(Scenarios!BK22,\"\")","v":0},{"$f":"IFERROR(Scenarios!BL22,\"\")","v":0},{"$f":"IFERROR(Scenarios!BM22,\"\")","v":0},{"$f":"IFERROR(Scenarios!BN22,\"\")","v":0},{"$f":"IFERROR(Scenarios!BO22,\"\")","v":0},{"$f":"IFERROR(Scenarios!BP22,\"\")","v":0},{"$f":"IFERROR(Scenarios!BQ22,\"\")","v":0},{"$f":"IFERROR(Scenarios!BR22,\"\")","v":0},{"$f":"IFERROR(Scenarios!BS22,\"\")","v":0},{"$f":"IFERROR(Scenarios!BT22,\"\")","v":0},{"$f":"IFERROR(Scenarios!BU22,\"\")","v":0},{"$f":"IFERROR(Scenarios!BV22,\"\")","v":0},{"$f":"IFERROR(Scenarios!BW22,\"\")","v":0},{"$f":"IFERROR(Scenarios!BX22,\"\")","v":0},{"$f":"IFERROR(Scenarios!BY22,\"\")","v":0},{"$f":"IFERROR(Scenarios!BZ22,\"\")","v":0},{"$f":"IFERROR(Scenarios!CA22,\"\")","v":0},{"$f":"IFERROR(Scenarios!CB22,\"\")","v":0},{"$f":"IFERROR(Scenarios!CC22,\"\")","v":0},{"$f":"IFERROR(Scenarios!CD22,\"\")","v":0},{"$f":"IFERROR(Scenarios!CE22,\"\")","v":0},{"$f":"IFERROR(Scenarios!CF22,\"\")","v":0},{"$f":"IFERROR(Scenarios!CG22,\"\")","v":0},{"$f":"IFERROR(Scenarios!CH22,\"\")","v":0},{"$f":"IFERROR(Scenarios!CI22,\"\")","v":0},{"$f":"IFERROR(Scenarios!CJ22,\"\")","v":0},{"$f":"IFERROR(Scenarios!CK22,\"\")","v":0},{"$f":"IFERROR(Scenarios!CL22,\"\")","v":0},{"$f":"IFERROR(Scenarios!CM22,\"\")","v":0},{"$f":"IFERROR(Scenarios!CN22,\"\")","v":0},{"$f":"IFERROR(Scenarios!CO22,\"\")","v":0},{"$f":"IFERROR(Scenarios!CP22,\"\")","v":0},{"$f":"IFERROR(Scenarios!CQ22,\"\")","v":0},{"$f":"IFERROR(Scenarios!CR22,\"\")","v":0},{"$f":"IFERROR(Scenarios!CS22,\"\")","v":0},{"$f":"IFERROR(Scenarios!CT22,\"\")","v":0},{"$f":"IFERROR(Scenarios!CU22,\"\")","v":0},{"$f":"IFERROR(Scenarios!CV22,\"\")","v":0},{"$f":"IFERROR(Scenarios!CW22,\"\")","v":0},{"$f":"IFERROR(Scenarios!CX22,\"\")","v":0},{"$f":"IFERROR(Scenarios!CY22,\"\")","v":0},{"$f":"IFERROR(Scenarios!CZ22,\"\")","v":0},{"$f":"IFERROR(Scenarios!DA22,\"\")","v":0}]
[{"$f":"IFERROR(Scenarios!A23,\"\")","v":0},{"$f":"IFERROR(Scenarios!B23,\"\")","v":0},{"$f":"IFERROR(Scenarios!C23,\"\")","v":0},{"$f":"IFERROR(Scenarios!D23,\"\")","v":0},{"$f":"IFERROR(Scenarios!E23,\"\")","v":0},{"$f":"IFERROR(Scenarios!F23,\"\")","v":0},{"$f":"IFERROR(Scenarios!G23,\"\")","v":0},{"$f":"IFERROR(Scenarios!H23,\"\")","v":0},{"$f":"IFERROR(Scenarios!I23,\"\")","v":0},{"$f":"IFERROR(Scenarios!J23,\"\")","v":0},{"$f":"IFERROR(Scenarios!K23,\"\")","v":0},{"$f":"IFERROR(Scenarios!L23,\"\")","v":0},{"$f":"IFERROR(Scenarios!M23,\"\")","v":0},{"$f":"IFERROR(Scenarios!N23,\"\")","v":0},{"$f":"IFERROR(Scenarios!O23,\"\")","v":0},{"$f":"IFERROR(Scenarios!P23,\"\")","v":0},{"$f":"IFERROR(Scenarios!Q23,\"\")","v":0},{"$f":"IFERROR(Scenarios!R23,\"\")","v":0},{"$f":"IFERROR(Scenarios!S23,\"\")","v":0},{"$f":"IFERROR(Scenarios!T23,\"\")","v":0},{"$f":"IFERROR(Scenarios!U23,\"\")","v":0},{"$f":"IFERROR(Scenarios!V23,\"\")","v":0},{"$f":"IFERROR(Scenarios!W23,\"\")","v":0},{"$f":"IFERROR(Scenarios!X23,\"\")","v":0},{"$f":"IFERROR(Scenarios!Y23,\"\")","v":0},{"$f":"IFERROR(Scenarios!Z23,\"\")","v":0},{"$f":"IFERROR(Scenarios!AA23,\"\")","v":0},{"$f":"IFERROR(Scenarios!AB23,\"\")","v":0},{"$f":"IFERROR(Scenarios!AC23,\"\")","v":0},{"$f":"IFERROR(Scenarios!AD23,\"\")","v":0},{"$f":"IFERROR(Scenarios!AE23,\"\")","v":0},{"$f":"IFERROR(Scenarios!AF23,\"\")","v":0},{"$f":"IFERROR(Scenarios!AG23,\"\")","v":0},{"$f":"IFERROR(Scenarios!AH23,\"\")","v":0},{"$f":"IFERROR(Scenarios!AI23,\"\")","v":0},{"$f":"IFERROR(Scenarios!AJ23,\"\")","v":0},{"$f":"IFERROR(Scenarios!AK23,\"\")","v":0},{"$f":"IFERROR(Scenarios!AL23,\"\")","v":0},{"$f":"IFERROR(Scenarios!AM23,\"\")","v":0},{"$f":"IFERROR(Scenarios!AN23,\"\")","v":0},{"$f":"IFERROR(Scenarios!AO23,\"\")","v":0},{"$f":"IFERROR(Scenarios!AP23,\"\")","v":0},{"$f":"IFERROR(Scenarios!AQ23,\"\")","v":0},{"$f":"IFERROR(Scenarios!AR23,\"\")","v":0},{"$f":"IFERROR(Scenarios!AS23,\"\")","v":0},{"$f":"IFERROR(Scenarios!AT23,\"\")","v":0},{"$f":"IFERROR(Scenarios!AU23,\"\")","v":0},{"$f":"IFERROR(Scenarios!AV23,\"\")","v":0},{"$f":"IFERROR(Scenarios!AW23,\"\")","v":0},{"$f":"IFERROR(Scenarios!AX23,\"\")","v":0},{"$f":"IFERROR(Scenarios!AY23,\"\")","v":0},{"$f":"IFERROR(Scenarios!AZ23,\"\")","v":0},{"$f":"IFERROR(Scenarios!BA23,\"\")","v":0},{"$f":"IFERROR(Scenarios!BB23,\"\")","v":0},{"$f":"IFERROR(Scenarios!BC23,\"\")","v":0},{"$f":"IFERROR(Scenarios!BD23,\"\")","v":0},{"$f":"IFERROR(Scenarios!BE23,\"\")","v":0},{"$f":"IFERROR(Scenarios!BF23,\"\")","v":0},{"$f":"IFERROR(Scenarios!BG23,\"\")","v":0},{"$f":"IFERROR(Scenarios!BH23,\"\")","v":0},{"$f":"IFERROR(Scenarios!BI23,\"\")","v":0},{"$f":"IFERROR(Scenarios!BJ23,\"\")","v":0},{"$f":"IFERROR(Scenarios!BK23,\"\")","v":0},{"$f":"IFERROR(Scenarios!BL23,\"\")","v":0},{"$f":"IFERROR(Scenarios!BM23,\"\")","v":0},{"$f":"IFERROR(Scenarios!BN23,\"\")","v":0},{"$f":"IFERROR(Scenarios!BO23,\"\")","v":0},{"$f":"IFERROR(Scenarios!BP23,\"\")","v":0},{"$f":"IFERROR(Scenarios!BQ23,\"\")","v":0},{"$f":"IFERROR(Scenarios!BR23,\"\")","v":0},{"$f":"IFERROR(Scenarios!BS23,\"\")","v":0},{"$f":"IFERROR(Scenarios!BT23,\"\")","v":0},{"$f":"IFERROR(Scenarios!BU23,\"\")","v":0},{"$f":"IFERROR(Scenarios!BV23,\"\")","v":0},{"$f":"IFERROR(Scenarios!BW23,\"\")","v":0},{"$f":"IFERROR(Scenarios!BX23,\"\")","v":0},{"$f":"IFERROR(Scenarios!BY23,\"\")","v":0},{"$f":"IFERROR(Scenarios!BZ23,\"\")","v":0},{"$f":"IFERROR(Scenarios!CA23,\"\")","v":0},{"$f":"IFERROR(Scenarios!CB23,\"\")","v":0},{"$f":"IFERROR(Scenarios!CC23,\"\")","v":0},{"$f":"IFERROR(Scenarios!CD23,\"\")","v":0},{"$f":"IFERROR(Scenarios!CE23,\"\")","v":0},{"$f":"IFERROR(Scenarios!CF23,\"\")","v":0},{"$f":"IFERROR(Scenarios!CG23,\"\")","v":0},{"$f":"IFERROR(Scenarios!CH23,\"\")","v":0},{"$f":"IFERROR(Scenarios!CI23,\"\")","v":0},{"$f":"IFERROR(Scenarios!CJ23,\"\")","v":0},{"$f":"IFERROR(Scenarios!CK23,\"\")","v":0},{"$f":"IFERROR(Scenarios!CL23,\"\")","v":0},{"$f":"IFERROR(Scenarios!CM23,\"\")","v":0},{"$f":"IFERROR(Scenarios!CN23,\"\")","v":0},{"$f":"IFERROR(Scenarios!CO23,\"\")","v":0},{"$f":"IFERROR(Scenarios!CP23,\"\")","v":0},{"$f":"IFERROR(Scenarios!CQ23,\"\")","v":0},{"$f":"IFERROR(Scenarios!CR23,\"\")","v":0},{"$f":"IFERROR(Scenarios!CS23,\"\")","v":0},{"$f":"IFERROR(Scenarios!CT23,\"\")","v":0},{"$f":"IFERROR(Scenarios!CU23,\"\")","v":0},{"$f":"IFERROR(Scenarios!CV23,\"\")","v":0},{"$f":"IFERROR(Scenarios!CW23,\"\")","v":0},{"$f":"IFERROR(Scenarios!CX23,\"\")","v":0},{"$f":"IFERROR(Scenarios!CY23,\"\")","v":0},{"$f":"IFERROR(Scenarios!CZ23,\"\")","v":0},{"$f":"IFERROR(Scenarios!DA23,\"\")","v":0}]
[{"$f":"IFERROR(Scenarios!A24,\"\")","v":0},{"$f":"IFERROR(Scenarios!B24,\"\")","v":0},{"$f":"IFERROR(Scenarios!C24,\"\")","v":0},{"$f":"IFERROR(Scenarios!D24,\"\")","v":0},{"$f":"IFERROR(Scenarios!E24,\"\")","v":0},{"$f":"IFERROR(Scenarios!F24,\"\")","v":0},{"$f":"IFERROR(Scenarios!G24,\"\")","v":0},{"$f":"IFERROR(Scenarios!H24,\"\")","v":0},{"$f":"IFERROR(Scenarios!I24,\"\")","v":0},{"$f":"IFERROR(Scenarios!J24,\"\")","v":0},{"$f":"IFERROR(Scenarios!K24,\"\")","v":0},{"$f":"IFERROR(Scenarios!L24,\"\")","v":0},{"$f":"IFERROR(Scenarios!M24,\"\")","v":0},{"$f":"IFERROR(Scenarios!N24,\"\")","v":0},{"$f":"IFERROR(Scenarios!O24,\"\")","v":0},{"$f":"IFERROR(Scenarios!P24,\"\")","v":0},{"$f":"IFERROR(Scenarios!Q24,\"\")","v":0},{"$f":"IFERROR(Scenarios!R24,\"\")","v":0},{"$f":"IFERROR(Scenarios!S24,\"\")","v":0},{"$f":"IFERROR(Scenarios!T24,\"\")","v":0},{"$f":"IFERROR(Scenarios!U24,\"\")","v":0},{"$f":"IFERROR(Scenarios!V24,\"\")","v":0},{"$f":"IFERROR(Scenarios!W24,\"\")","v":0},{"$f":"IFERROR(Scenarios!X24,\"\")","v":0},{"$f":"IFERROR(Scenarios!Y24,\"\")","v":0},{"$f":"IFERROR(Scenarios!Z24,\"\")","v":0},{"$f":"IFERROR(Scenarios!AA24,\"\")","v":0},{"$f":"IFERROR(Scenarios!AB24,\"\")","v":0},{"$f":"IFERROR(Scenarios!AC24,\"\")","v":0},{"$f":"IFERROR(Scenarios!AD24,\"\")","v":0},{"$f":"IFERROR(Scenarios!AE24,\"\")","v":0},{"$f":"IFERROR(Scenarios!AF24,\"\")","v":0},{"$f":"IFERROR(Scenarios!AG24,\"\")","v":0},{"$f":"IFERROR(Scenarios!AH24,\"\")","v":0},{"$f":"IFERROR(Scenarios!AI24,\"\")","v":0},{"$f":"IFERROR(Scenarios!AJ24,\"\")","v":0},{"$f":"IFERROR(Scenarios!AK24,\"\")","v":0},{"$f":"IFERROR(Scenarios!AL24,\"\")","v":0},{"$f":"IFERROR(Scenarios!AM24,\"\")","v":0},{"$f":"IFERROR(Scenarios!AN24,\"\")","v":0},{"$f":"IFERROR(Scenarios!AO24,\"\")","v":0},{"$f":"IFERROR(Scenarios!AP24,\"\")","v":0},{"$f":"IFERROR(Scenarios!AQ24,\"\")","v":0},{"$f":"IFERROR(Scenarios!AR24,\"\")","v":0},{"$f":"IFERROR(Scenarios!AS24,\"\")","v":0},{"$f":"IFERROR(Scenarios!AT24,\"\")","v":0},{"$f":"IFERROR(Scenarios!AU24,\"\")","v":0},{"$f":"IFERROR(Scenarios!AV24,\"\")","v":0},{"$f":"IFERROR(Scenarios!AW24,\"\")","v":0},{"$f":"IFERROR(Scenarios!AX24,\"\")","v":0},{"$f":"IFERROR(Scenarios!AY24,\"\")","v":0},{"$f":"IFERROR(Scenarios!AZ24,\"\")","v":0},{"$f":"IFERROR(Scenarios!BA24,\"\")","v":0},{"$f":"IFERROR(Scenarios!BB24,\"\")","v":0},{"$f":"IFERROR(Scenarios!BC24,\"\")","v":0},{"$f":"IFERROR(Scenarios!BD24,\"\")","v":0},{"$f":"IFERROR(Scenarios!BE24,\"\")","v":0},{"$f":"IFERROR(Scenarios!BF24,\"\")","v":0},{"$f":"IFERROR(Scenarios!BG24,\"\")","v":0},{"$f":"IFERROR(Scenarios!BH24,\"\")","v":0},{"$f":"IFERROR(Scenarios!BI24,\"\")","v":0},{"$f":"IFERROR(Scenarios!BJ24,\"\")","v":0},{"$f":"IFERROR(Scenarios!BK24,\"\")","v":0},{"$f":"IFERROR(Scenarios!BL24,\"\")","v":0},{"$f":"IFERROR(Scenarios!BM24,\"\")","v":0},{"$f":"IFERROR(Scenarios!BN24,\"\")","v":0},{"$f":"IFERROR(Scenarios!BO24,\"\")","v":0},{"$f":"IFERROR(Scenarios!BP24,\"\")","v":0},{"$f":"IFERROR(Scenarios!BQ24,\"\")","v":0},{"$f":"IFERROR(Scenarios!BR24,\"\")","v":0},{"$f":"IFERROR(Scenarios!BS24,\"\")","v":0},{"$f":"IFERROR(Scenarios!BT24,\"\")","v":0},{"$f":"IFERROR(Scenarios!BU24,\"\")","v":0},{"$f":"IFERROR(Scenarios!BV24,\"\")","v":0},{"$f":"IFERROR(Scenarios!BW24,\"\")","v":0},{"$f":"IFERROR(Scenarios!BX24,\"\")","v":0},{"$f":"IFERROR(Scenarios!BY24,\"\")","v":0},{"$f":"IFERROR(Scenarios!BZ24,\"\")","v":0},{"$f":"IFERROR(Scenarios!CA24,\"\")","v":0},{"$f":"IFERROR(Scenarios!CB24,\"\")","v":0},{"$f":"IFERROR(Scenarios!CC24,\"\")","v":0},{"$f":"IFERROR(Scenarios!CD24,\"\")","v":0},{"$f":"IFERROR(Scenarios!CE24,\"\")","v":0},{"$f":"IFERROR(Scenarios!CF24,\"\")","v":0},{"$f":"IFERROR(Scenarios!CG24,\"\")","v":0},{"$f":"IFERROR(Scenarios!CH24,\"\")","v":0},{"$f":"IFERROR(Scenarios!CI24,\"\")","v":0},{"$f":"IFERROR(Scenarios!CJ24,\"\")","v":0},{"$f":"IFERROR(Scenarios!CK24,\"\")","v":0},{"$f":"IFERROR(Scenarios!CL24,\"\")","v":0},{"$f":"IFERROR(Scenarios!CM24,\"\")","v":0},{"$f":"IFERROR(Scenarios!CN24,\"\")","v":0},{"$f":"IFERROR(Scenarios!CO24,\"\")","v":0},{"$f":"IFERROR(Scenarios!CP24,\"\")","v":0},{"$f":"IFERROR(Scenarios!CQ24,\"\")","v":0},{"$f":"IFERROR(Scenarios!CR24,\"\")","v":0},{"$f":"IFERROR(Scenarios!CS24,\"\")","v":0},{"$f":"IFERROR(Scenarios!CT24,\"\")","v":0},{"$f":"IFERROR(Scenarios!CU24,\"\")","v":0},{"$f":"IFERROR(Scenarios!CV24,\"\")","v":0},{"$f":"IFERROR(Scenarios!CW24,\"\")","v":0},{"$f":"IFERROR(Scenarios!CX24,\"\")","v":0},{"$f":"IFERROR(Scenarios!CY24,\"\")","v":0},{"$f":"IFERROR(Scenarios!CZ24,\"\")","v":0},{"$f":"IFERROR(Scenarios!DA24,\"\")","v":0}]
[{"$f":"IFERROR(Scenarios!A25,\"\")","v":0},{"$f":"IFERROR(Scenarios!B25,\"\")","v":0},{"$f":"IFERROR(Scenarios!C25,\"\")","v":0},{"$f":"IFERROR(Scenarios!D25,\"\")","v":0},{"$f":"IFERROR(Scenarios!E25,\"\")","v":0},{"$f":"IFERROR(Scenarios!F25,\"\")","v":0},{"$f":"IFERROR(Scenarios!G25,\"\")","v":0},{"$f":"IFERROR(Scenarios!H25,\"\")","v":0},{"$f":"IFERROR(Scenarios!I25,\"\")","v":0},{"$f":"IFERROR(Scenarios!J25,\"\")","v":0},{"$f":"IFERROR(Scenarios!K25,\"\")","v":0},{"$f":"IFERROR(Scenarios!L25,\"\")","v":0},{"$f":"IFERROR(Scenarios!M25,\"\")","v":0},{"$f":"IFERROR(Scenarios!N25,\"\")","v":0},{"$f":"IFERROR(Scenarios!O25,\"\")","v":0},{"$f":"IFERROR(Scenarios!P25,\"\")","v":0},{"$f":"IFERROR(Scenarios!Q25,\"\")","v":0},{"$f":"IFERROR(Scenarios!R25,\"\")","v":0},{"$f":"IFERROR(Scenarios!S25,\"\")","v":0},{"$f":"IFERROR(Scenarios!T25,\"\")","v":0},{"$f":"IFERROR(Scenarios!U25,\"\")","v":0},{"$f":"IFERROR(Scenarios!V25,\"\")","v":0},{"$f":"IFERROR(Scenarios!W25,\"\")","v":0},{"$f":"IFERROR(Scenarios!X25,\"\")","v":0},{"$f":"IFERROR(Scenarios!Y25,\"\")","v":0},{"$f":"IFERROR(Scenarios!Z25,\"\")","v":0},{"$f":"IFERROR(Scenarios!AA25,\"\")","v":0},{"$f":"IFERROR(Scenarios!AB25,\"\")","v":0},{"$f":"IFERROR(Scenarios!AC25,\"\")","v":0},{"$f":"IFERROR(Scenarios!AD25,\"\")","v":0},{"$f":"IFERROR(Scenarios!AE25,\"\")","v":0},{"$f":"IFERROR(Scenarios!AF25,\"\")","v":0},{"$f":"IFERROR(Scenarios!AG25,\"\")","v":0},{"$f":"IFERROR(Scenarios!AH25,\"\")","v":0},{"$f":"IFERROR(Scenarios!AI25,\"\")","v":0},{"$f":"IFERROR(Scenarios!AJ25,\"\")","v":0},{"$f":"IFERROR(Scenarios!AK25,\"\")","v":0},{"$f":"IFERROR(Scenarios!AL25,\"\")","v":0},{"$f":"IFERROR(Scenarios!AM25,\"\")","v":0},{"$f":"IFERROR(Scenarios!AN25,\"\")","v":0},{"$f":"IFERROR(Scenarios!AO25,\"\")","v":0},{"$f":"IFERROR(Scenarios!AP25,\"\")","v":0},{"$f":"IFERROR(Scenarios!AQ25,\"\")","v":0},{"$f":"IFERROR(Scenarios!AR25,\"\")","v":0},{"$f":"IFERROR(Scenarios!AS25,\"\")","v":0},{"$f":"IFERROR(Scenarios!AT25,\"\")","v":0},{"$f":"IFERROR(Scenarios!AU25,\"\")","v":0},{"$f":"IFERROR(Scenarios!AV25,\"\")","v":0},{"$f":"IFERROR(Scenarios!AW25,\"\")","v":0},{"$f":"IFERROR(Scenarios!AX25,\"\")","v":0},{"$f":"IFERROR(Scenarios!AY25,\"\")","v":0},{"$f":"IFERROR(Scenarios!AZ25,\"\")","v":0},{"$f":"IFERROR(Scenarios!BA25,\"\")","v":0},{"$f":"IFERROR(Scenarios!BB25,\"\")","v":0},{"$f":"IFERROR(Scenarios!BC25,\"\")","v":0},{"$f":"IFERROR(Scenarios!BD25,\"\")","v":0},{"$f":"IFERROR(Scenarios!BE25,\"\")","v":0},{"$f":"IFERROR(Scenarios!BF25,\"\")","v":0},{"$f":"IFERROR(Scenarios!BG25,\"\")","v":0},{"$f":"IFERROR(Scenarios!BH25,\"\")","v":0},{"$f":"IFERROR(Scenarios!BI25,\"\")","v":0},{"$f":"IFERROR(Scenarios!BJ25,\"\")","v":0},{"$f":"IFERROR(Scenarios!BK25,\"\")","v":0},{"$f":"IFERROR(Scenarios!BL25,\"\")","v":0},{"$f":"IFERROR(Scenarios!BM25,\"\")","v":0},{"$f":"IFERROR(Scenarios!BN25,\"\")","v":0},{"$f":"IFERROR(Scenarios!BO25,\"\")","v":0},{"$f":"IFERROR(Scenarios!BP25,\"\")","v":0},{"$f":"IFERROR(Scenarios!BQ25,\"\")","v":0},{"$f":"IFERROR(Scenarios!BR25,\"\")","v":0},{"$f":"IFERROR(Scenarios!BS25,\"\")","v":0},{"$f":"IFERROR(Scenarios!BT25,\"\")","v":0},{"$f":"IFERROR(Scenarios!BU25,\"\")","v":0},{"$f":"IFERROR(Scenarios!BV25,\"\")","v":0},{"$f":"IFERROR(Scenarios!BW25,\"\")","v":0},{"$f":"IFERROR(Scenarios!BX25,\"\")","v":0},{"$f":"IFERROR(Scenarios!BY25,\"\")","v":0},{"$f":"IFERROR(Scenarios!BZ25,\"\")","v":0},{"$f":"IFERROR(Scenarios!CA25,\"\")","v":0},{"$f":"IFERROR(Scenarios!CB25,\"\")","v":0},{"$f":"IFERROR(Scenarios!CC25,\"\")","v":0},{"$f":"IFERROR(Scenarios!CD25,\"\")","v":0},{"$f":"IFERROR(Scenarios!CE25,\"\")","v":0},{"$f":"IFERROR(Scenarios!CF25,\"\")","v":0},{"$f":"IFERROR(Scenarios!CG25,\"\")","v":0},{"$f":"IFERROR(Scenarios!CH25,\"\")","v":0},{"$f":"IFERROR(Scenarios!CI25,\"\")","v":0},{"$f":"IFERROR(Scenarios!CJ25,\"\")","v":0},{"$f":"IFERROR(Scenarios!CK25,\"\")","v":0},{"$f":"IFERROR(Scenarios!CL25,\"\")","v":0},{"$f":"IFERROR(Scenarios!CM25,\"\")","v":0},{"$f":"IFERROR(Scenarios!CN25,\"\")","v":0},{"$f":"IFERROR(Scenarios!CO25,\"\")","v":0},{"$f":"IFERROR(Scenarios!CP25,\"\")","v":0},{"$f":"IFERROR(Scenarios!CQ25,\"\")","v":0},{"$f":"IFERROR(Scenarios!CR25,\"\")","v":0},{"$f":"IFERROR(Scenarios!CS25,\"\")","v":0},{"$f":"IFERROR(Scenarios!CT25,\"\")","v":0},{"$f":"IFERROR(Scenarios!CU25,\"\")","v":0},{"$f":"IFERROR(Scenarios!CV25,\"\")","v":0},{"$f":"IFERROR(Scenarios!CW25,\"\")","v":0},{"$f":"IFERROR(Scenarios!CX25,\"\")","v":0},{"$f":"IFERROR(Scenarios!CY25,\"\")","v":0},{"$f":"IFERROR(Scenarios!CZ25,\"\")","v":0},{"$f":"IFERROR(Scenarios!DA25,\"\")","v":0}]
[{"$f":"IFERROR(Scenarios!A26,\"\")","v":0},{"$f":"IFERROR(Scenarios!B26,\"\")","v":0},{"$f":"IFERROR(Scenarios!C26,\"\")","v":0},{"$f":"IFERROR(Scenarios!D26,\"\")","v":0},{"$f":"IFERROR(Scenarios!E26,\"\")","v":0},{"$f":"IFERROR(Scenarios!F26,\"\")","v":0},{"$f":"IFERROR(Scenarios!G26,\"\")","v":0},{"$f":"IFERROR(Scenarios!H26,\"\")","v":0},{"$f":"IFERROR(Scenarios!I26,\"\")","v":0},{"$f":"IFERROR(Scenarios!J26,\"\")","v":0},{"$f":"IFERROR(Scenarios!K26,\"\")","v":0},{"$f":"IFERROR(Scenarios!L26,\"\")","v":0},{"$f":"IFERROR(Scenarios!M26,\"\")","v":0},{"$f":"IFERROR(Scenarios!N26,\"\")","v":0},{"$f":"IFERROR(Scenarios!O26,\"\")","v":0},{"$f":"IFERROR(Scenarios!P26,\"\")","v":0},{"$f":"IFERROR(Scenarios!Q26,\"\")","v":0},{"$f":"IFERROR(Scenarios!R26,\"\")","v":0},{"$f":"IFERROR(Scenarios!S26,\"\")","v":0},{"$f":"IFERROR(Scenarios!T26,\"\")","v":0},{"$f":"IFERROR(Scenarios!U26,\"\")","v":0},{"$f":"IFERROR(Scenarios!V26,\"\")","v":0},{"$f":"IFERROR(Scenarios!W26,\"\")","v":0},{"$f":"IFERROR(Scenarios!X26,\"\")","v":0},{"$f":"IFERROR(Scenarios!Y26,\"\")","v":0},{"$f":"IFERROR(Scenarios!Z26,\"\")","v":0},{"$f":"IFERROR(Scenarios!AA26,\"\")","v":0},{"$f":"IFERROR(Scenarios!AB26,\"\")","v":0},{"$f":"IFERROR(Scenarios!AC26,\"\")","v":0},{"$f":"IFERROR(Scenarios!AD26,\"\")","v":0},{"$f":"IFERROR(Scenarios!AE26,\"\")","v":0},{"$f":"IFERROR(Scenarios!AF26,\"\")","v":0},{"$f":"IFERROR(Scenarios!AG26,\"\")","v":0},{"$f":"IFERROR(Scenarios!AH26,\"\")","v":0},{"$f":"IFERROR(Scenarios!AI26,\"\")","v":0},{"$f":"IFERROR(Scenarios!AJ26,\"\")","v":0},{"$f":"IFERROR(Scenarios!AK26,\"\")","v":0},{"$f":"IFERROR(Scenarios!AL26,\"\")","v":0},{"$f":"IFERROR(Scenarios!AM26,\"\")","v":0},{"$f":"IFERROR(Scenarios!AN26,\"\")","v":0},{"$f":"IFERROR(Scenarios!AO26,\"\")","v":0},{"$f":"IFERROR(Scenarios!AP26,\"\")","v":0},{"$f":"IFERROR(Scenarios!AQ26,\"\")","v":0},{"$f":"IFERROR(Scenarios!AR26,\"\")","v":0},{"$f":"IFERROR(Scenarios!AS26,\"\")","v":0},{"$f":"IFERROR(Scenarios!AT26,\"\")","v":0},{"$f":"IFERROR(Scenarios!AU26,\"\")","v":0},{"$f":"IFERROR(Scenarios!AV26,\"\")","v":0},{"$f":"IFERROR(Scenarios!AW26,\"\")","v":0},{"$f":"IFERROR(Scenarios!AX26,\"\")","v":0},{"$f":"IFERROR(Scenarios!AY26,\"\")","v":0},{"$f":"IFERROR(Scenarios!AZ26,\"\")","v":0},{"$f":"IFERROR(Scenarios!BA26,\"\")","v":0},{"$f":"IFERROR(Scenarios!BB26,\"\")","v":0},{"$f":"IFERROR(Scenarios!BC26,\"\")","v":0},{"$f":"IFERROR(Scenarios!BD26,\"\")","v":0},{"$f":"IFERROR(Scenarios!BE26,\"\")","v":0},{"$f":"IFERROR(Scenarios!BF26,\"\")","v":0},{"$f":"IFERROR(Scenarios!BG26,\"\")","v":0},{"$f":"IFERROR(Scenarios!BH26,\"\")","v":0},{"$f":"IFERROR(Scenarios!BI26,\"\")","v":0},{"$f":"IFERROR(Scenarios!BJ26,\"\")","v":0},{"$f":"IFERROR(Scenarios!BK26,\"\")","v":0},{"$f":"IFERROR(Scenarios!BL26,\"\")","v":0},{"$f":"IFERROR(Scenarios!BM26,\"\")","v":0},{"$f":"IFERROR(Scenarios!BN26,\"\")","v":0},{"$f":"IFERROR(Scenarios!BO26,\"\")","v":0},{"$f":"IFERROR(Scenarios!BP26,\"\")","v":0},{"$f":"IFERROR(Scenarios!BQ26,\"\")","v":0},{"$f":"IFERROR(Scenarios!BR26,\"\")","v":0},{"$f":"IFERROR(Scenarios!BS26,\"\")","v":0},{"$f":"IFERROR(Scenarios!BT26,\"\")","v":0},{"$f":"IFERROR(Scenarios!BU26,\"\")","v":0},{"$f":"IFERROR(Scenarios!BV26,\"\")","v":0},{"$f":"IFERROR(Scenarios!BW26,\"\")","v":0},{"$f":"IFERROR(Scenarios!BX26,\"\")","v":0},{"$f":"IFERROR(Scenarios!BY26,\"\")","v":0},{"$f":"IFERROR(Scenarios!BZ26,\"\")","v":0},{"$f":"IFERROR(Scenarios!CA26,\"\")","v":0},{"$f":"IFERROR(Scenarios!CB26,\"\")","v":0},{"$f":"IFERROR(Scenarios!CC26,\"\")","v":0},{"$f":"IFERROR(Scenarios!CD26,\"\")","v":0},{"$f":"IFERROR(Scenarios!CE26,\"\")","v":0},{"$f":"IFERROR(Scenarios!CF26,\"\")","v":0},{"$f":"IFERROR(Scenarios!CG26,\"\")","v":0},{"$f":"IFERROR(Scenarios!CH26,\"\")","v":0},{"$f":"IFERROR(Scenarios!CI26,\"\")","v":0},{"$f":"IFERROR(Scenarios!CJ26,\"\")","v":0},{"$f":"IFERROR(Scenarios!CK26,\"\")","v":0},{"$f":"IFERROR(Scenarios!CL26,\"\")","v":0},{"$f":"IFERROR(Scenarios!CM26,\"\")","v":0},{"$f":"IFERROR(Scenarios!CN26,\"\")","v":0},{"$f":"IFERROR(Scenarios!CO26,\"\")","v":0},{"$f":"IFERROR(Scenarios!CP26,\"\")","v":0},{"$f":"IFERROR(Scenarios!CQ26,\"\")","v":0},{"$f":"IFERROR(Scenarios!CR26,\"\")","v":0},{"$f":"IFERROR(Scenarios!CS26,\"\")","v":0},{"$f":"IFERROR(Scenarios!CT26,\"\")","v":0},{"$f":"IFERROR(Scenarios!CU26,\"\")","v":0},{"$f":"IFERROR(Scenarios!CV26,\"\")","v":0},{"$f":"IFERROR(Scenarios!CW26,\"\")","v":0},{"$f":"IFERROR(Scenarios!CX26,\"\")","v":0},{"$f":"IFERROR(Scenarios!CY26,\"\")","v":0},{"$f":"IFERROR(Scenarios!CZ26,\"\")","v":0},{"$f":"IFERROR(Scenarios!DA26,\"\")","v":0}]
[{"$f":"IFERROR(Scenarios!A27,\"\")","v":0},{"$f":"IFERROR(Scenarios!B27,\"\")","v":0},{"$f":"IFERROR(Scenarios!C27,\"\")","v":0},{"$f":"IFERROR(Scenarios!D27,\"\")","v":0},{"$f":"IFERROR(Scenarios!E27,\"\")","v":0},{"$f":"IFERROR(Scenarios!F27,\"\")","v":0},{"$f":"IFERROR(Scenarios!G27,\"\")","v":0},{"$f":"IFERROR(Scenarios!H27,\"\")","v":0},{"$f":"IFERROR(Scenarios!I27,\"\")","v":0},{"$f":"IFERROR(Scenarios!J27,\"\")","v":0},{"$f":"IFERROR(Scenarios!K27,\"\")","v":0},{"$f":"IFERROR(Scenarios!L27,\"\")","v":0},{"$f":"IFERROR(Scenarios!M27,\"\")","v":0},{"$f":"IFERROR(Scenarios!N27,\"\")","v":0},{"$f":"IFERROR(Scenarios!O27,\"\")","v":0},{"$f":"IFERROR(Scenarios!P27,\"\")","v":0},{"$f":"IFERROR(Scenarios!Q27,\"\")","v":0},{"$f":"IFERROR(Scenarios!R27,\"\")","v":0},{"$f":"IFERROR(Scenarios!S27,\"\")","v":0},{"$f":"IFERROR(Scenarios!T27,\"\")","v":0},{"$f":"IFERROR(Scenarios!U27,\"\")","v":0},{"$f":"IFERROR(Scenarios!V27,\"\")","v":0},{"$f":"IFERROR(Scenarios!W27,\"\")","v":0},{"$f":"IFERROR(Scenarios!X27,\"\")","v":0},{"$f":"IFERROR(Scenarios!Y27,\"\")","v":0},{"$f":"IFERROR(Scenarios!Z27,\"\")","v":0},{"$f":"IFERROR(Scenarios!AA27,\"\")","v":0},{"$f":"IFERROR(Scenarios!AB27,\"\")","v":0},{"$f":"IFERROR(Scenarios!AC27,\"\")","v":0},{"$f":"IFERROR(Scenarios!AD27,\"\")","v":0},{"$f":"IFERROR(Scenarios!AE27,\"\")","v":0},{"$f":"IFERROR(Scenarios!AF27,\"\")","v":0},{"$f":"IFERROR(Scenarios!AG27,\"\")","v":0},{"$f":"IFERROR(Scenarios!AH27,\"\")","v":0},{"$f":"IFERROR(Scenarios!AI27,\"\")","v":0},{"$f":"IFERROR(Scenarios!AJ27,\"\")","v":0},{"$f":"IFERROR(Scenarios!AK27,\"\")","v":0},{"$f":"IFERROR(Scenarios!AL27,\"\")","v":0},{"$f":"IFERROR(Scenarios!AM27,\"\")","v":0},{"$f":"IFERROR(Scenarios!AN27,\"\")","v":0},{"$f":"IFERROR(Scenarios!AO27,\"\")","v":0},{"$f":"IFERROR(Scenarios!AP27,\"\")","v":0},{"$f":"IFERROR(Scenarios!AQ27,\"\")","v":0},{"$f":"IFERROR(Scenarios!AR27,\"\")","v":0},{"$f":"IFERROR(Scenarios!AS27,\"\")","v":0},{"$f":"IFERROR(Scenarios!AT27,\"\")","v":0},{"$f":"IFERROR(Scenarios!AU27,\"\")","v":0},{"$f":"IFERROR(Scenarios!AV27,\"\")","v":0},{"$f":"IFERROR(Scenarios!AW27,\"\")","v":0},{"$f":"IFERROR(Scenarios!AX27,\"\")","v":0},{"$f":"IFERROR(Scenarios!AY27,\"\")","v":0},{"$f":"IFERROR(Scenarios!AZ27,\"\")","v":0},{"$f":"IFERROR(Scenarios!BA27,\"\")","v":0},{"$f":"IFERROR(Scenarios!BB27,\"\")","v":0},{"$f":"IFERROR(Scenarios!BC27,\"\")","v":0},{"$f":"IFERROR(Scenarios!BD27,\"\")","v":0},{"$f":"IFERROR(Scenarios!BE27,\"\")","v":0},{"$f":"IFERROR(Scenarios!BF27,\"\")","v":0},{"$f":"IFERROR(Scenarios!BG27,\"\")","v":0},{"$f":"IFERROR(Scenarios!BH27,\"\")","v":0},{"$f":"IFERROR(Scenarios!BI27,\"\")","v":0},{"$f":"IFERROR(Scenarios!BJ27,\"\")","v":0},{"$f":"IFERROR(Scenarios!BK27,\"\")","v":0},{"$f":"IFERROR(Scenarios!BL27,\"\")","v":0},{"$f":"IFERROR(Scenarios!BM27,\"\")","v":0},{"$f":"IFERROR(Scenarios!BN27,\"\")","v":0},{"$f":"IFERROR(Scenarios!BO27,\"\")","v":0},{"$f":"IFERROR(Scenarios!BP27,\"\")","v":0},{"$f":"IFERROR(Scenarios!BQ27,\"\")","v":0},{"$f":"IFERROR(Scenarios!BR27,\"\")","v":0},{"$f":"IFERROR(Scenarios!BS27,\"\")","v":0},{"$f":"IFERROR(Scenarios!BT27,\"\")","v":0},{"$f":"IFERROR(Scenarios!BU27,\"\")","v":0},{"$f":"IFERROR(Scenarios!BV27,\"\")","v":0},{"$f":"IFERROR(Scenarios!BW27,\"\")","v":0},{"$f":"IFERROR(Scenarios!BX27,\"\")","v":0},{"$f":"IFERROR(Scenarios!BY27,\"\")","v":0},{"$f":"IFERROR(Scenarios!BZ27,\"\")","v":0},{"$f":"IFERROR(Scenarios!CA27,\"\")","v":0},{"$f":"IFERROR(Scenarios!CB27,\"\")","v":0},{"$f":"IFERROR(Scenarios!CC27,\"\")","v":0},{"$f":"IFERROR(Scenarios!CD27,\"\")","v":0},{"$f":"IFERROR(Scenarios!CE27,\"\")","v":0},{"$f":"IFERROR(Scenarios!CF27,\"\")","v":0},{"$f":"IFERROR(Scenarios!CG27,\"\")","v":0},{"$f":"IFERROR(Scenarios!CH27,\"\")","v":0},{"$f":"IFERROR(Scenarios!CI27,\"\")","v":0},{"$f":"IFERROR(Scenarios!CJ27,\"\")","v":0},{"$f":"IFERROR(Scenarios!CK27,\"\")","v":0},{"$f":"IFERROR(Scenarios!CL27,\"\")","v":0},{"$f":"IFERROR(Scenarios!CM27,\"\")","v":0},{"$f":"IFERROR(Scenarios!CN27,\"\")","v":0},{"$f":"IFERROR(Scenarios!CO27,\"\")","v":0},{"$f":"IFERROR(Scenarios!CP27,\"\")","v":0},{"$f":"IFERROR(Scenarios!CQ27,\"\")","v":0},{"$f":"IFERROR(Scenarios!CR27,\"\")","v":0},{"$f":"IFERROR(Scenarios!CS27,\"\")","v":0},{"$f":"IFERROR(Scenarios!CT27,\"\")","v":0},{"$f":"IFERROR(Scenarios!CU27,\"\")","v":0},{"$f":"IFERROR(Scenarios!CV27,\"\")","v":0},{"$f":"IFERROR(Scenarios!CW27,\"\")","v":0},{"$f":"IFERROR(Scenarios!CX27,\"\")","v":0},{"$f":"IFERROR(Scenarios!CY27,\"\")","v":0},{"$f":"IFERROR(Scenarios!CZ27,\"\")","v":0},{"$f":"IFERROR(Scenarios!DA27,\"\")","v":0}]
[{"$f":"IFERROR(Scenarios!A28,\"\")","v":0},{"$f":"IFERROR(Scenarios!B28,\"\")","v":0},{"$f":"IFERROR(Scenarios!C28,\"\")","v":0},{"$f":"IFERROR(Scenarios!D28,\"\")","v":0},{"$f":"IFERROR(Scenarios!E28,\"\")","v":0},{"$f":"IFERROR(Scenarios!F28,\"\")","v":0},{"$f":"IFERROR(Scenarios!G28,\"\")","v":0},{"$f":"IFERROR(Scenarios!H28,\"\")","v":0},{"$f":"IFERROR(Scenarios!I28,\"\")","v":0},{"$f":"IFERROR(Scenarios!J28,\"\")","v":0},{"$f":"IFERROR(Scenarios!K28,\"\")","v":0},{"$f":"IFERROR(Scenarios!L28,\"\")","v":0},{"$f":"IFERROR(Scenarios!M28,\"\")","v":0},{"$f":"IFERROR(Scenarios!N28,\"\")","v":0},{"$f":"IFERROR(Scenarios!O28,\"\")","v":0},{"$f":"IFERROR(Scenarios!P28,\"\")","v":0},{"$f":"IFERROR(Scenarios!Q28,\"\")","v":0},{"$f":"IFERROR(Scenarios!R28,\"\")","v":0},{"$f":"IFERROR(Scenarios!S28,\"\")","v":0},{"$f":"IFERROR(Scenarios!T28,\"\")","v":0},{"$f":"IFERROR(Scenarios!U28,\"\")","v":0},{"$f":"IFERROR(Scenarios!V28,\"\")","v":0},{"$f":"IFERROR(Scenarios!W28,\"\")","v":0},{"$f":"IFERROR(Scenarios!X28,\"\")","v":0},{"$f":"IFERROR(Scenarios!Y28,\"\")","v":0},{"$f":"IFERROR(Scenarios!Z28,\"\")","v":0},{"$f":"IFERROR(Scenarios!AA28,\"\")","v":0},{"$f":"IFERROR(Scenarios!AB28,\"\")","v":0},{"$f":"IFERROR(Scenarios!AC28,\"\")","v":0},{"$f":"IFERROR(Scenarios!AD28,\"\")","v":0},{"$f":"IFERROR(Scenarios!AE28,\"\")","v":0},{"$f":"IFERROR(Scenarios!AF28,\"\")","v":0},{"$f":"IFERROR(Scenarios!AG28,\"\")","v":0},{"$f":"IFERROR(Scenarios!AH28,\"\")","v":0},{"$f":"IFERROR(Scenarios!AI28,\"\")","v":0},{"$f":"IFERROR(Scenarios!AJ28,\"\")","v":0},{"$f":"IFERROR(Scenarios!AK28,\"\")","v":0},{"$f":"IFERROR(Scenarios!AL28,\"\")","v":0},{"$f":"IFERROR(Scenarios!AM28,\"\")","v":0},{"$f":"IFERROR(Scenarios!AN28,\"\")","v":0},{"$f":"IFERROR(Scenarios!AO28,\"\")","v":0},{"$f":"IFERROR(Scenarios!AP28,\"\")","v":0},{"$f":"IFERROR(Scenarios!AQ28,\"\")","v":0},{"$f":"IFERROR(Scenarios!AR28,\"\")","v":0},{"$f":"IFERROR(Scenarios!AS28,\"\")","v":0},{"$f":"IFERROR(Scenarios!AT28,\"\")","v":0},{"$f":"IFERROR(Scenarios!AU28,\"\")","v":0},{"$f":"IFERROR(Scenarios!AV28,\"\")","v":0},{"$f":"IFERROR(Scenarios!AW28,\"\")","v":0},{"$f":"IFERROR(Scenarios!AX28,\"\")","v":0},{"$f":"IFERROR(Scenarios!AY28,\"\")","v":0},{"$f":"IFERROR(Scenarios!AZ28,\"\")","v":0},{"$f":"IFERROR(Scenarios!BA28,\"\")","v":0},{"$f":"IFERROR(Scenarios!BB28,\"\")","v":0},{"$f":"IFERROR(Scenarios!BC28,\"\")","v":0},{"$f":"IFERROR(Scenarios!BD28,\"\")","v":0},{"$f":"IFERROR(Scenarios!BE28,\"\")","v":0},{"$f":"IFERROR(Scenarios!BF28,\"\")","v":0},{"$f":"IFERROR(Scenarios!BG28,\"\")","v":0},{"$f":"IFERROR(Scenarios!BH28,\"\")","v":0},{"$f":"IFERROR(Scenarios!BI28,\"\")","v":0},{"$f":"IFERROR(Scenarios!BJ28,\"\")","v":0},{"$f":"IFERROR(Scenarios!BK28,\"\")","v":0},{"$f":"IFERROR(Scenarios!BL28,\"\")","v":0},{"$f":"IFERROR(Scenarios!BM28,\"\")","v":0},{"$f":"IFERROR(Scenarios!BN28,\"\")","v":0},{"$f":"IFERROR(Scenarios!BO28,\"\")","v":0},{"$f":"IFERROR(Scenarios!BP28,\"\")","v":0},{"$f":"IFERROR(Scenarios!BQ28,\"\")","v":0},{"$f":"IFERROR(Scenarios!BR28,\"\")","v":0},{"$f":"IFERROR(Scenarios!BS28,\"\")","v":0},{"$f":"IFERROR(Scenarios!BT28,\"\")","v":0},{"$f":"IFERROR(Scenarios!BU28,\"\")","v":0},{"$f":"IFERROR(Scenarios!BV28,\"\")","v":0},{"$f":"IFERROR(Scenarios!BW28,\"\")","v":0},{"$f":"IFERROR(Scenarios!BX28,\"\")","v":0},{"$f":"IFERROR(Scenarios!BY28,\"\")","v":0},{"$f":"IFERROR(Scenarios!BZ28,\"\")","v":0},{"$f":"IFERROR(Scenarios!CA28,\"\")","v":0},{"$f":"IFERROR(Scenarios!CB28,\"\")","v":0},{"$f":"IFERROR(Scenarios!CC28,\"\")","v":0},{"$f":"IFERROR(Scenarios!CD28,\"\")","v":0},{"$f":"IFERROR(Scenarios!CE28,\"\")","v":0},{"$f":"IFERROR(Scenarios!CF28,\"\")","v":0},{"$f":"IFERROR(Scenarios!CG28,\"\")","v":0},{"$f":"IFERROR(Scenarios!CH28,\"\")","v":0},{"$f":"IFERROR(Scenarios!CI28,\"\")","v":0},{"$f":"IFERROR(Scenarios!CJ28,\"\")","v":0},{"$f":"IFERROR(Scenarios!CK28,\"\")","v":0},{"$f":"IFERROR(Scenarios!CL28,\"\")","v":0},{"$f":"IFERROR(Scenarios!CM28,\"\")","v":0},{"$f":"IFERROR(Scenarios!CN28,\"\")","v":0},{"$f":"IFERROR(Scenarios!CO28,\"\")","v":0},{"$f":"IFERROR(Scenarios!CP28,\"\")","v":0},{"$f":"IFERROR(Scenarios!CQ28,\"\")","v":0},{"$f":"IFERROR(Scenarios!CR28,\"\")","v":0},{"$f":"IFERROR(Scenarios!CS28,\"\")","v":0},{"$f":"IFERROR(Scenarios!CT28,\"\")","v":0},{"$f":"IFERROR(Scenarios!CU28,\"\")","v":0},{"$f":"IFERROR(Scenarios!CV28,\"\")","v":0},{"$f":"IFERROR(Scenarios!CW28,\"\")","v":0},{"$f":"IFERROR(Scenarios!CX28,\"\")","v":0},{"$f":"IFERROR(Scenarios!CY28,\"\")","v":0},{"$f":"IFERROR(Scenarios!CZ28,\"\")","v":0},{"$f":"IFERROR(Scenarios!DA28,\"\")","v":0}]
[{"$f":"IFERROR(Scenarios!A29,\"\")","v":0},{"$f":"IFERROR(Scenarios!B29,\"\")","v":0},{"$f":"IFERROR(Scenarios!C29,\"\")","v":0},{"$f":"IFERROR(Scenarios!D29,\"\")","v":0},{"$f":"IFERROR(Scenarios!E29,\"\")","v":0},{"$f":"IFERROR(Scenarios!F29,\"\")","v":0},{"$f":"IFERROR(Scenarios!G29,\"\")","v":0},{"$f":"IFERROR(Scenarios!H29,\"\")","v":0},{"$f":"IFERROR(Scenarios!I29,\"\")","v":0},{"$f":"IFERROR(Scenarios!J29,\"\")","v":0},{"$f":"IFERROR(Scenarios!K29,\"\")","v":0},{"$f":"IFERROR(Scenarios!L29,\"\")","v":0},{"$f":"IFERROR(Scenarios!M29,\"\")","v":0},{"$f":"IFERROR(Scenarios!N29,\"\")","v":0},{"$f":"IFERROR(Scenarios!O29,\"\")","v":0},{"$f":"IFERROR(Scenarios!P29,\"\")","v":0},{"$f":"IFERROR(Scenarios!Q29,\"\")","v":0},{"$f":"IFERROR(Scenarios!R29,\"\")","v":0},{"$f":"IFERROR(Scenarios!S29,\"\")","v":0},{"$f":"IFERROR(Scenarios!T29,\"\")","v":0},{"$f":"IFERROR(Scenarios!U29,\"\")","v":0},{"$f":"IFERROR(Scenarios!V29,\"\")","v":0},{"$f":"IFERROR(Scenarios!W29,\"\")","v":0},{"$f":"IFERROR(Scenarios!X29,\"\")","v":0},{"$f":"IFERROR(Scenarios!Y29,\"\")","v":0},{"$f":"IFERROR(Scenarios!Z29,\"\")","v":0},{"$f":"IFERROR(Scenarios!AA29,\"\")","v":0},{"$f":"IFERROR(Scenarios!AB29,\"\")","v":0},{"$f":"IFERROR(Scenarios!AC29,\"\")","v":0},{"$f":"IFERROR(Scenarios!AD29,\"\")","v":0},{"$f":"IFERROR(Scenarios!AE29,\"\")","v":0},{"$f":"IFERROR(Scenarios!AF29,\"\")","v":0},{"$f":"IFERROR(Scenarios!AG29,\"\")","v":0},{"$f":"IFERROR(Scenarios!AH29,\"\")","v":0},{"$f":"IFERROR(Scenarios!AI29,\"\")","v":0},{"$f":"IFERROR(Scenarios!AJ29,\"\")","v":0},{"$f":"IFERROR(Scenarios!AK29,\"\")","v":0},{"$f":"IFERROR(Scenarios!AL29,\"\")","v":0},{"$f":"IFERROR(Scenarios!AM29,\"\")","v":0},{"$f":"IFERROR(Scenarios!AN29,\"\")","v":0},{"$f":"IFERROR(Scenarios!AO29,\"\")","v":0},{"$f":"IFERROR(Scenarios!AP29,\"\")","v":0},{"$f":"IFERROR(Scenarios!AQ29,\"\")","v":0},{"$f":"IFERROR(Scenarios!AR29,\"\")","v":0},{"$f":"IFERROR(Scenarios!AS29,\"\")","v":0},{"$f":"IFERROR(Scenarios!AT29,\"\")","v":0},{"$f":"IFERROR(Scenarios!AU29,\"\")","v":0},{"$f":"IFERROR(Scenarios!AV29,\"\")","v":0},{"$f":"IFERROR(Scenarios!AW29,\"\")","v":0},{"$f":"IFERROR(Scenarios!AX29,\"\")","v":0},{"$f":"IFERROR(Scenarios!AY29,\"\")","v":0},{"$f":"IFERROR(Scenarios!AZ29,\"\")","v":0},{"$f":"IFERROR(Scenarios!BA29,\"\")","v":0},{"$f":"IFERROR(Scenarios!BB29,\"\")","v":0},{"$f":"IFERROR(Scenarios!BC29,\"\")","v":0},{"$f":"IFERROR(Scenarios!BD29,\"\")","v":0},{"$f":"IFERROR(Scenarios!BE29,\"\")","v":0},{"$f":"IFERROR(Scenarios!BF29,\"\")","v":0},{"$f":"IFERROR(Scenarios!BG29,\"\")","v":0},{"$f":"IFERROR(Scenarios!BH29,\"\")","v":0},{"$f":"IFERROR(Scenarios!BI29,\"\")","v":0},{"$f":"IFERROR(Scenarios!BJ29,\"\")","v":0},{"$f":"IFERROR(Scenarios!BK29,\"\")","v":0},{"$f":"IFERROR(Scenarios!BL29,\"\")","v":0},{"$f":"IFERROR(Scenarios!BM29,\"\")","v":0},{"$f":"IFERROR(Scenarios!BN29,\"\")","v":0},{"$f":"IFERROR(Scenarios!BO29,\"\")","v":0},{"$f":"IFERROR(Scenarios!BP29,\"\")","v":0},{"$f":"IFERROR(Scenarios!BQ29,\"\")","v":0},{"$f":"IFERROR(Scenarios!BR29,\"\")","v":0},{"$f":"IFERROR(Scenarios!BS29,\"\")","v":0},{"$f":"IFERROR(Scenarios!BT29,\"\")","v":0},{"$f":"IFERROR(Scenarios!BU29,\"\")","v":0},{"$f":"IFERROR(Scenarios!BV29,\"\")","v":0},{"$f":"IFERROR(Scenarios!BW29,\"\")","v":0},{"$f":"IFERROR(Scenarios!BX29,\"\")","v":0},{"$f":"IFERROR(Scenarios!BY29,\"\")","v":0},{"$f":"IFERROR(Scenarios!BZ29,\"\")","v":0},{"$f":"IFERROR(Scenarios!CA29,\"\")","v":0},{"$f":"IFERROR(Scenarios!CB29,\"\")","v":0},{"$f":"IFERROR(Scenarios!CC29,\"\")","v":0},{"$f":"IFERROR(Scenarios!CD29,\"\")","v":0},{"$f":"IFERROR(Scenarios!CE29,\"\")","v":0},{"$f":"IFERROR(Scenarios!CF29,\"\")","v":0},{"$f":"IFERROR(Scenarios!CG29,\"\")","v":0},{"$f":"IFERROR(Scenarios!CH29,\"\")","v":0},{"$f":"IFERROR(Scenarios!CI29,\"\")","v":0},{"$f":"IFERROR(Scenarios!CJ29,\"\")","v":0},{"$f":"IFERROR(Scenarios!CK29,\"\")","v":0},{"$f":"IFERROR(Scenarios!CL29,\"\")","v":0},{"$f":"IFERROR(Scenarios!CM29,\"\")","v":0},{"$f":"IFERROR(Scenarios!CN29,\"\")","v":0},{"$f":"IFERROR(Scenarios!CO29,\"\")","v":0},{"$f":"IFERROR(Scenarios!CP29,\"\")","v":0},{"$f":"IFERROR(Scenarios!CQ29,\"\")","v":0},{"$f":"IFERROR(Scenarios!CR29,\"\")","v":0},{"$f":"IFERROR(Scenarios!CS29,\"\")","v":0},{"$f":"IFERROR(Scenarios!CT29,\"\")","v":0},{"$f":"IFERROR(Scenarios!CU29,\"\")","v":0},{"$f":"IFERROR(Scenarios!CV29,\"\")","v":0},{"$f":"IFERROR(Scenarios!CW29,\"\")","v":0},{"$f":"IFERROR(Scenarios!CX29,\"\")","v":0},{"$f":"IFERROR(Scenarios!CY29,\"\")","v":0},{"$f":"IFERROR(Scenarios!CZ29,\"\")","v":0},{"$f":"IFERROR(Scenarios!DA29,\"\")","v":0}]
[{"$f":"IFERROR(Scenarios!A30,\"\")","v":0},{"$f":"IFERROR(Scenarios!B30,\"\")","v":0},{"$f":"IFERROR(Scenarios!C30,\"\")","v":0},{"$f":"IFERROR(Scenarios!D30,\"\")","v":0},{"$f":"IFERROR(Scenarios!E30,\"\")","v":0},{"$f":"IFERROR(Scenarios!F30,\"\")","v":0},{"$f":"IFERROR(Scenarios!G30,\"\")","v":0},{"$f":"IFERROR(Scenarios!H30,\"\")","v":0},{"$f":"IFERROR(Scenarios!I30,\"\")","v":0},{"$f":"IFERROR(Scenarios!J30,\"\")","v":0},{"$f":"IFERROR(Scenarios!K30,\"\")","v":0},{"$f":"IFERROR(Scenarios!L30,\"\")","v":0},{"$f":"IFERROR(Scenarios!M30,\"\")","v":0},{"$f":"IFERROR(Scenarios!N30,\"\")","v":0},{"$f":"IFERROR(Scenarios!O30,\"\")","v":0},{"$f":"IFERROR(Scenarios!P30,\"\")","v":0},{"$f":"IFERROR(Scenarios!Q30,\"\")","v":0},{"$f":"IFERROR(Scenarios!R30,\"\")","v":0},{"$f":"IFERROR(Scenarios!S30,\"\")","v":0},{"$f":"IFERROR(Scenarios!T30,\"\")","v":0},{"$f":"IFERROR(Scenarios!U30,\"\")","v":0},{"$f":"IFERROR(Scenarios!V30,\"\")","v":0},{"$f":"IFERROR(Scenarios!W30,\"\")","v":0},{"$f":"IFERROR(Scenarios!X30,\"\")","v":0},{"$f":"IFERROR(Scenarios!Y30,\"\")","v":0},{"$f":"IFERROR(Scenarios!Z30,\"\")","v":0},{"$f":"IFERROR(Scenarios!AA30,\"\")","v":0},{"$f":"IFERROR(Scenarios!AB30,\"\")","v":0},{"$f":"IFERROR(Scenarios!AC30,\"\")","v":0},{"$f":"IFERROR(Scenarios!AD30,\"\")","v":0},{"$f":"IFERROR(Scenarios!AE30,\"\")","v":0},{"$f":"IFERROR(Scenarios!AF30,\"\")","v":0},{"$f":"IFERROR(Scenarios!AG30,\"\")","v":0},{"$f":"IFERROR(Scenarios!AH30,\"\")","v":0},{"$f":"IFERROR(Scenarios!AI30,\"\")","v":0},{"$f":"IFERROR(Scenarios!AJ30,\"\")","v":0},{"$f":"IFERROR(Scenarios!AK30,\"\")","v":0},{"$f":"IFERROR(Scenarios!AL30,\"\")","v":0},{"$f":"IFERROR(Scenarios!AM30,\"\")","v":0},{"$f":"IFERROR(Scenarios!AN30,\"\")","v":0},{"$f":"IFERROR(Scenarios!AO30,\"\")","v":0},{"$f":"IFERROR(Scenarios!AP30,\"\")","v":0},{"$f":"IFERROR(Scenarios!AQ30,\"\")","v":0},{"$f":"IFERROR(Scenarios!AR30,\"\")","v":0},{"$f":"IFERROR(Scenarios!AS30,\"\")","v":0},{"$f":"IFERROR(Scenarios!AT30,\"\")","v":0},{"$f":"IFERROR(Scenarios!AU30,\"\")","v":0},{"$f":"IFERROR(Scenarios!AV30,\"\")","v":0},{"$f":"IFERROR(Scenarios!AW30,\"\")","v":0},{"$f":"IFERROR(Scenarios!AX30,\"\")","v":0},{"$f":"IFERROR(Scenarios!AY30,\"\")","v":0},{"$f":"IFERROR(Scenarios!AZ30,\"\")","v":0},{"$f":"IFERROR(Scenarios!BA30,\"\")","v":0},{"$f":"IFERROR(Scenarios!BB30,\"\")","v":0},{"$f":"IFERROR(Scenarios!BC30,\"\")","v":0},{"$f":"IFERROR(Scenarios!BD30,\"\")","v":0},{"$f":"IFERROR(Scenarios!BE30,\"\")","v":0},{"$f":"IFERROR(Scenarios!BF30,\"\")","v":0},{"$f":"IFERROR(Scenarios!BG30,\"\")","v":0},{"$f":"IFERROR(Scenarios!BH30,\"\")","v":0},{"$f":"IFERROR(Scenarios!BI30,\"\")","v":0},{"$f":"IFERROR(Scenarios!BJ30,\"\")","v":0},{"$f":"IFERROR(Scenarios!BK30,\"\")","v":0},{"$f":"IFERROR(Scenarios!BL30,\"\")","v":0},{"$f":"IFERROR(Scenarios!BM30,\"\")","v":0},{"$f":"IFERROR(Scenarios!BN30,\"\")","v":0},{"$f":"IFERROR(Scenarios!BO30,\"\")","v":0},{"$f":"IFERROR(Scenarios!BP30,\"\")","v":0},{"$f":"IFERROR(Scenarios!BQ30,\"\")","v":0},{"$f":"IFERROR(Scenarios!BR30,\"\")","v":0},{"$f":"IFERROR(Scenarios!BS30,\"\")","v":0},{"$f":"IFERROR(Scenarios!BT30,\"\")","v":0},{"$f":"IFERROR(Scenarios!BU30,\"\")","v":0},{"$f":"IFERROR(Scenarios!BV30,\"\")","v":0},{"$f":"IFERROR(Scenarios!BW30,\"\")","v":0},{"$f":"IFERROR(Scenarios!BX30,\"\")","v":0},{"$f":"IFERROR(Scenarios!BY30,\"\")","v":0},{"$f":"IFERROR(Scenarios!BZ30,\"\")","v":0},{"$f":"IFERROR(Scenarios!CA30,\"\")","v":0},{"$f":"IFERROR(Scenarios!CB30,\"\")","v":0},{"$f":"IFERROR(Scenarios!CC30,\"\")","v":0},{"$f":"IFERROR(Scenarios!CD30,\"\")","v":0},{"$f":"IFERROR(Scenarios!CE30,\"\")","v":0},{"$f":"IFERROR(Scenarios!CF30,\"\")","v":0},{"$f":"IFERROR(Scenarios!CG30,\"\")","v":0},{"$f":"IFERROR(Scenarios!CH30,\"\")","v":0},{"$f":"IFERROR(Scenarios!CI30,\"\")","v":0},{"$f":"IFERROR(Scenarios!CJ30,\"\")","v":0},{"$f":"IFERROR(Scenarios!CK30,\"\")","v":0},{"$f":"IFERROR(Scenarios!CL30,\"\")","v":0},{"$f":"IFERROR(Scenarios!CM30,\"\")","v":0},{"$f":"IFERROR(Scenarios!CN30,\"\")","v":0},{"$f":"IFERROR(Scenarios!CO30,\"\")","v":0},{"$f":"IFERROR(Scenarios!CP30,\"\")","v":0},{"$f":"IFERROR(Scenarios!CQ30,\"\")","v":0},{"$f":"IFERROR(Scenarios!CR30,\"\")","v":0},{"$f":"IFERROR(Scenarios!CS30,\"\")","v":0},{"$f":"IFERROR(Scenarios!CT30,\"\")","v":0},{"$f":"IFERROR(Scenarios!CU30,\"\")","v":0},{"$f":"IFERROR(Scenarios!CV30,\"\")","v":0},{"$f":"IFERROR(Scenarios!CW30,\"\")","v":0},{"$f":"IFERROR(Scenarios!CX30,\"\")","v":0},{"$f":"IFERROR(Scenarios!CY30,\"\")","v":0},{"$f":"IFERROR(Scenarios!CZ30,\"\")","v":0},{"$f":"IFERROR(Scenarios!DA30,\"\")","v":0}]
[{"$f":"IFERROR(Scenarios!A31,\"\")","v":0},{"$f":"IFERROR(Scenarios!B31,\"\")","v":0},{"$f":"IFERROR(Scenarios!C31,\"\")","v":0},{"$f":"IFERROR(Scenarios!D31,\"\")","v":0},{"$f":"IFERROR(Scenarios!E31,\"\")","v":0},{"$f":"IFERROR(Scenarios!F31,\"\")","v":0},{"$f":"IFERROR(Scenarios!G31,\"\")","v":0},{"$f":"IFERROR(Scenarios!H31,\"\")","v":0},{"$f":"IFERROR(Scenarios!I31,\"\")","v":0},{"$f":"IFERROR(Scenarios!J31,\"\")","v":0},{"$f":"IFERROR(Scenarios!K31,\"\")","v":0},{"$f":"IFERROR(Scenarios!L31,\"\")","v":0},{"$f":"IFERROR(Scenarios!M31,\"\")","v":0},{"$f":"IFERROR(Scenarios!N31,\"\")","v":0},{"$f":"IFERROR(Scenarios!O31,\"\")","v":0},{"$f":"IFERROR(Scenarios!P31,\"\")","v":0},{"$f":"IFERROR(Scenarios!Q31,\"\")","v":0},{"$f":"IFERROR(Scenarios!R31,\"\")","v":0},{"$f":"IFERROR(Scenarios!S31,\"\")","v":0},{"$f":"IFERROR(Scenarios!T31,\"\")","v":0},{"$f":"IFERROR(Scenarios!U31,\"\")","v":0},{"$f":"IFERROR(Scenarios!V31,\"\")","v":0},{"$f":"IFERROR(Scenarios!W31,\"\")","v":0},{"$f":"IFERROR(Scenarios!X31,\"\")","v":0},{"$f":"IFERROR(Scenarios!Y31,\"\")","v":0},{"$f":"IFERROR(Scenarios!Z31,\"\")","v":0},{"$f":"IFERROR(Scenarios!AA31,\"\")","v":0},{"$f":"IFERROR(Scenarios!AB31,\"\")","v":0},{"$f":"IFERROR(Scenarios!AC31,\"\")","v":0},{"$f":"IFERROR(Scenarios!AD31,\"\")","v":0},{"$f":"IFERROR(Scenarios!AE31,\"\")","v":0},{"$f":"IFERROR(Scenarios!AF31,\"\")","v":0},{"$f":"IFERROR(Scenarios!AG31,\"\")","v":0},{"$f":"IFERROR(Scenarios!AH31,\"\")","v":0},{"$f":"IFERROR(Scenarios!AI31,\"\")","v":0},{"$f":"IFERROR(Scenarios!AJ31,\"\")","v":0},{"$f":"IFERROR(Scenarios!AK31,\"\")","v":0},{"$f":"IFERROR(Scenarios!AL31,\"\")","v":0},{"$f":"IFERROR(Scenarios!AM31,\"\")","v":0},{"$f":"IFERROR(Scenarios!AN31,\"\")","v":0},{"$f":"IFERROR(Scenarios!AO31,\"\")","v":0},{"$f":"IFERROR(Scenarios!AP31,\"\")","v":0},{"$f":"IFERROR(Scenarios!AQ31,\"\")","v":0},{"$f":"IFERROR(Scenarios!AR31,\"\")","v":0},{"$f":"IFERROR(Scenarios!AS31,\"\")","v":0},{"$f":"IFERROR(Scenarios!AT31,\"\")","v":0},{"$f":"IFERROR(Scenarios!AU31,\"\")","v":0},{"$f":"IFERROR(Scenarios!AV31,\"\")","v":0},{"$f":"IFERROR(Scenarios!AW31,\"\")","v":0},{"$f":"IFERROR(Scenarios!AX31,\"\")","v":0},{"$f":"IFERROR(Scenarios!AY31,\"\")","v":0},{"$f":"IFERROR(Scenarios!AZ31,\"\")","v":0},{"$f":"IFERROR(Scenarios!BA31,\"\")","v":0},{"$f":"IFERROR(Scenarios!BB31,\"\")","v":0},{"$f":"IFERROR(Scenarios!BC31,\"\")","v":0},{"$f":"IFERROR(Scenarios!BD31,\"\")","v":0},{"$f":"IFERROR(Scenarios!BE31,\"\")","v":0},{"$f":"IFERROR(Scenarios!BF31,\"\")","v":0},{"$f":"IFERROR(Scenarios!BG31,\"\")","v":0},{"$f":"IFERROR(Scenarios!BH31,\"\")","v":0},{"$f":"IFERROR(Scenarios!BI31,\"\")","v":0},{"$f":"IFERROR(Scenarios!BJ31,\"\")","v":0},{"$f":"IFERROR(Scenarios!BK31,\"\")","v":0},{"$f":"IFERROR(Scenarios!BL31,\"\")","v":0},{"$f":"IFERROR(Scenarios!BM31,\"\")","v":0},{"$f":"IFERROR(Scenarios!BN31,\"\")","v":0},{"$f":"IFERROR(Scenarios!BO31,\"\")","v":0},{"$f":"IFERROR(Scenarios!BP31,\"\")","v":0},{"$f":"IFERROR(Scenarios!BQ31,\"\")","v":0},{"$f":"IFERROR(Scenarios!BR31,\"\")","v":0},{"$f":"IFERROR(Scenarios!BS31,\"\")","v":0},{"$f":"IFERROR(Scenarios!BT31,\"\")","v":0},{"$f":"IFERROR(Scenarios!BU31,\"\")","v":0},{"$f":"IFERROR(Scenarios!BV31,\"\")","v":0},{"$f":"IFERROR(Scenarios!BW31,\"\")","v":0},{"$f":"IFERROR(Scenarios!BX31,\"\")","v":0},{"$f":"IFERROR(Scenarios!BY31,\"\")","v":0},{"$f":"IFERROR(Scenarios!BZ31,\"\")","v":0},{"$f":"IFERROR(Scenarios!CA31,\"\")","v":0},{"$f":"IFERROR(Scenarios!CB31,\"\")","v":0},{"$f":"IFERROR(Scenarios!CC31,\"\")","v":0},{"$f":"IFERROR(Scenarios!CD31,\"\")","v":0},{"$f":"IFERROR(Scenarios!CE31,\"\")","v":0},{"$f":"IFERROR(Scenarios!CF31,\"\")","v":0},{"$f":"IFERROR(Scenarios!CG31,\"\")","v":0},{"$f":"IFERROR(Scenarios!CH31,\"\")","v":0},{"$f":"IFERROR(Scenarios!CI31,\"\")","v":0},{"$f":"IFERROR(Scenarios!CJ31,\"\")","v":0},{"$f":"IFERROR(Scenarios!CK31,\"\")","v":0},{"$f":"IFERROR(Scenarios!CL31,\"\")","v":0},{"$f":"IFERROR(Scenarios!CM31,\"\")","v":0},{"$f":"IFERROR(Scenarios!CN31,\"\")","v":0},{"$f":"IFERROR(Scenarios!CO31,\"\")","v":0},{"$f":"IFERROR(Scenarios!CP31,\"\")","v":0},{"$f":"IFERROR(Scenarios!CQ31,\"\")","v":0},{"$f":"IFERROR(Scenarios!CR31,\"\")","v":0},{"$f":"IFERROR(Scenarios!CS31,\"\")","v":0},{"$f":"IFERROR(Scenarios!CT31,\"\")","v":0},{"$f":"IFERROR(Scenarios!CU31,\"\")","v":0},{"$f":"IFERROR(Scenarios!CV31,\"\")","v":0},{"$f":"IFERROR(Scenarios!CW31,\"\")","v":0},{"$f":"IFERROR(Scenarios!CX31,\"\")","v":0},{"$f":"IFERROR(Scenarios!CY31,\"\")","v":0},{"$f":"IFERROR(Scenarios!CZ31,\"\")","v":0},{"$f":"IFERROR(Scenarios!DA31,\"\")","v":0}]
[{"$f":"IFERROR(Scenarios!A32,\"\")","v":0},{"$f":"IFERROR(Scenarios!B32,\"\")","v":0},{"$f":"IFERROR(Scenarios!C32,\"\")","v":0},{"$f":"IFERROR(Scenarios!D32,\"\")","v":0},{"$f":"IFERROR(Scenarios!E32,\"\")","v":0},{"$f":"IFERROR(Scenarios!F32,\"\")","v":0},{"$f":"IFERROR(Scenarios!G32,\"\")","v":0},{"$f":"IFERROR(Scenarios!H32,\"\")","v":0},{"$f":"IFERROR(Scenarios!I32,\"\")","v":0},{"$f":"IFERROR(Scenarios!J32,\"\")","v":0},{"$f":"IFERROR(Scenarios!K32,\"\")","v":0},{"$f":"IFERROR(Scenarios!L32,\"\")","v":0},{"$f":"IFERROR(Scenarios!M32,\"\")","v":0},{"$f":"IFERROR(Scenarios!N32,\"\")","v":0},{"$f":"IFERROR(Scenarios!O32,\"\")","v":0},{"$f":"IFERROR(Scenarios!P32,\"\")","v":0},{"$f":"IFERROR(Scenarios!Q32,\"\")","v":0},{"$f":"IFERROR(Scenarios!R32,\"\")","v":0},{"$f":"IFERROR(Scenarios!S32,\"\")","v":0},{"$f":"IFERROR(Scenarios!T32,\"\")","v":0},{"$f":"IFERROR(Scenarios!U32,\"\")","v":0},{"$f":"IFERROR(Scenarios!V32,\"\")","v":0},{"$f":"IFERROR(Scenarios!W32,\"\")","v":0},{"$f":"IFERROR(Scenarios!X32,\"\")","v":0},{"$f":"IFERROR(Scenarios!Y32,\"\")","v":0},{"$f":"IFERROR(Scenarios!Z32,\"\")","v":0},{"$f":"IFERROR(Scenarios!AA32,\"\")","v":0},{"$f":"IFERROR(Scenarios!AB32,\"\")","v":0},{"$f":"IFERROR(Scenarios!AC32,\"\")","v":0},{"$f":"IFERROR(Scenarios!AD32,\"\")","v":0},{"$f":"IFERROR(Scenarios!AE32,\"\")","v":0},{"$f":"IFERROR(Scenarios!AF32,\"\")","v":0},{"$f":"IFERROR(Scenarios!AG32,\"\")","v":0},{"$f":"IFERROR(Scenarios!AH32,\"\")","v":0},{"$f":"IFERROR(Scenarios!AI32,\"\")","v":0},{"$f":"IFERROR(Scenarios!AJ32,\"\")","v":0},{"$f":"IFERROR(Scenarios!AK32,\"\")","v":0},{"$f":"IFERROR(Scenarios!AL32,\"\")","v":0},{"$f":"IFERROR(Scenarios!AM32,\"\")","v":0},{"$f":"IFERROR(Scenarios!AN32,\"\")","v":0},{"$f":"IFERROR(Scenarios!AO32,\"\")","v":0},{"$f":"IFERROR(Scenarios!AP32,\"\")","v":0},{"$f":"IFERROR(Scenarios!AQ32,\"\")","v":0},{"$f":"IFERROR(Scenarios!AR32,\"\")","v":0},{"$f":"IFERROR(Scenarios!AS32,\"\")","v":0},{"$f":"IFERROR(Scenarios!AT32,\"\")","v":0},{"$f":"IFERROR(Scenarios!AU32,\"\")","v":0},{"$f":"IFERROR(Scenarios!AV32,\"\")","v":0},{"$f":"IFERROR(Scenarios!AW32,\"\")","v":0},{"$f":"IFERROR(Scenarios!AX32,\"\")","v":0},{"$f":"IFERROR(Scenarios!AY32,\"\")","v":0},{"$f":"IFERROR(Scenarios!AZ32,\"\")","v":0},{"$f":"IFERROR(Scenarios!BA32,\"\")","v":0},{"$f":"IFERROR(Scenarios!BB32,\"\")","v":0},{"$f":"IFERROR(Scenarios!BC32,\"\")","v":0},{"$f":"IFERROR(Scenarios!BD32,\"\")","v":0},{"$f":"IFERROR(Scenarios!BE32,\"\")","v":0},{"$f":"IFERROR(Scenarios!BF32,\"\")","v":0},{"$f":"IFERROR(Scenarios!BG32,\"\")","v":0},{"$f":"IFERROR(Scenarios!BH32,\"\")","v":0},{"$f":"IFERROR(Scenarios!BI32,\"\")","v":0},{"$f":"IFERROR(Scenarios!BJ32,\"\")","v":0},{"$f":"IFERROR(Scenarios!BK32,\"\")","v":0},{"$f":"IFERROR(Scenarios!BL32,\"\")","v":0},{"$f":"IFERROR(Scenarios!BM32,\"\")","v":0},{"$f":"IFERROR(Scenarios!BN32,\"\")","v":0},{"$f":"IFERROR(Scenarios!BO32,\"\")","v":0},{"$f":"IFERROR(Scenarios!BP32,\"\")","v":0},{"$f":"IFERROR(Scenarios!BQ32,\"\")","v":0},{"$f":"IFERROR(Scenarios!BR32,\"\")","v":0},{"$f":"IFERROR(Scenarios!BS32,\"\")","v":0},{"$f":"IFERROR(Scenarios!BT32,\"\")","v":0},{"$f":"IFERROR(Scenarios!BU32,\"\")","v":0},{"$f":"IFERROR(Scenarios!BV32,\"\")","v":0},{"$f":"IFERROR(Scenarios!BW32,\"\")","v":0},{"$f":"IFERROR(Scenarios!BX32,\"\")","v":0},{"$f":"IFERROR(Scenarios!BY32,\"\")","v":0},{"$f":"IFERROR(Scenarios!BZ32,\"\")","v":0},{"$f":"IFERROR(Scenarios!CA32,\"\")","v":0},{"$f":"IFERROR(Scenarios!CB32,\"\")","v":0},{"$f":"IFERROR(Scenarios!CC32,\"\")","v":0},{"$f":"IFERROR(Scenarios!CD32,\"\")","v":0},{"$f":"IFERROR(Scenarios!CE32,\"\")","v":0},{"$f":"IFERROR(Scenarios!CF32,\"\")","v":0},{"$f":"IFERROR(Scenarios!CG32,\"\")","v":0},{"$f":"IFERROR(Scenarios!CH32,\"\")","v":0},{"$f":"IFERROR(Scenarios!CI32,\"\")","v":0},{"$f":"IFERROR(Scenarios!CJ32,\"\")","v":0},{"$f":"IFERROR(Scenarios!CK32,\"\")","v":0},{"$f":"IFERROR(Scenarios!CL32,\"\")","v":0},{"$f":"IFERROR(Scenarios!CM32,\"\")","v":0},{"$f":"IFERROR(Scenarios!CN32,\"\")","v":0},{"$f":"IFERROR(Scenarios!CO32,\"\")","v":0},{"$f":"IFERROR(Scenarios!CP32,\"\")","v":0},{"$f":"IFERROR(Scenarios!CQ32,\"\")","v":0},{"$f":"IFERROR(Scenarios!CR32,\"\")","v":0},{"$f":"IFERROR(Scenarios!CS32,\"\")","v":0},{"$f":"IFERROR(Scenarios!CT32,\"\")","v":0},{"$f":"IFERROR(Scenarios!CU32,\"\")","v":0},{"$f":"IFERROR(Scenarios!CV32,\"\")","v":0},{"$f":"IFERROR(Scenarios!CW32,\"\")","v":0},{"$f":"IFERROR(Scenarios!CX32,\"\")","v":0},{"$f":"IFERROR(Scenarios!CY32,\"\")","v":0},{"$f":"IFERROR(Scenarios!CZ32,\"\")","v":0},{"$f":"IFERROR(Scenarios!DA32,\"\")","v":0}]
[{"$f":"IFERROR(Scenarios!A33,\"\")","v":0},{"$f":"IFERROR(Scenarios!B33,\"\")","v":0},{"$f":"IFERROR(Scenarios!C33,\"\")","v":0},{"$f":"IFERROR(Scenarios!D33,\"\")","v":0},{"$f":"IFERROR(Scenarios!E33,\"\")","v":0},{"$f":"IFERROR(Scenarios!F33,\"\")","v":0},{"$f":"IFERROR(Scenarios!G33,\"\")","v":0},{"$f":"IFERROR(Scenarios!H33,\"\")","v":0},{"$f":"IFERROR(Scenarios!I33,\"\")","v":0},{"$f":"IFERROR(Scenarios!J33,\"\")","v":0},{"$f":"IFERROR(Scenarios!K33,\"\")","v":0},{"$f":"IFERROR(Scenarios!L33,\"\")","v":0},{"$f":"IFERROR(Scenarios!M33,\"\")","v":0},{"$f":"IFERROR(Scenarios!N33,\"\")","v":0},{"$f":"IFERROR(Scenarios!O33,\"\")","v":0},{"$f":"IFERROR(Scenarios!P33,\"\")","v":0},{"$f":"IFERROR(Scenarios!Q33,\"\")","v":0},{"$f":"IFERROR(Scenarios!R33,\"\")","v":0},{"$f":"IFERROR(Scenarios!S33,\"\")","v":0},{"$f":"IFERROR(Scenarios!T33,\"\")","v":0},{"$f":"IFERROR(Scenarios!U33,\"\")","v":0},{"$f":"IFERROR(Scenarios!V33,\"\")","v":0},{"$f":"IFERROR(Scenarios!W33,\"\")","v":0},{"$f":"IFERROR(Scenarios!X33,\"\")","v":0},{"$f":"IFERROR(Scenarios!Y33,\"\")","v":0},{"$f":"IFERROR(Scenarios!Z33,\"\")","v":0},{"$f":"IFERROR(Scenarios!AA33,\"\")","v":0},{"$f":"IFERROR(Scenarios!AB33,\"\")","v":0},{"$f":"IFERROR(Scenarios!AC33,\"\")","v":0},{"$f":"IFERROR(Scenarios!AD33,\"\")","v":0},{"$f":"IFERROR(Scenarios!AE33,\"\")","v":0},{"$f":"IFERROR(Scenarios!AF33,\"\")","v":0},{"$f":"IFERROR(Scenarios!AG33,\"\")","v":0},{"$f":"IFERROR(Scenarios!AH33,\"\")","v":0},{"$f":"IFERROR(Scenarios!AI33,\"\")","v":0},{"$f":"IFERROR(Scenarios!AJ33,\"\")","v":0},{"$f":"IFERROR(Scenarios!AK33,\"\")","v":0},{"$f":"IFERROR(Scenarios!AL33,\"\")","v":0},{"$f":"IFERROR(Scenarios!AM33,\"\")","v":0},{"$f":"IFERROR(Scenarios!AN33,\"\")","v":0},{"$f":"IFERROR(Scenarios!AO33,\"\")","v":0},{"$f":"IFERROR(Scenarios!AP33,\"\")","v":0},{"$f":"IFERROR(Scenarios!AQ33,\"\")","v":0},{"$f":"IFERROR(Scenarios!AR33,\"\")","v":0},{"$f":"IFERROR(Scenarios!AS33,\"\")","v":0},{"$f":"IFERROR(Scenarios!AT33,\"\")","v":0},{"$f":"IFERROR(Scenarios!AU33,\"\")","v":0},{"$f":"IFERROR(Scenarios!AV33,\"\")","v":0},{"$f":"IFERROR(Scenarios!AW33,\"\")","v":0},{"$f":"IFERROR(Scenarios!AX33,\"\")","v":0},{"$f":"IFERROR(Scenarios!AY33,\"\")","v":0},{"$f":"IFERROR(Scenarios!AZ33,\"\")","v":0},{"$f":"IFERROR(Scenarios!BA33,\"\")","v":0},{"$f":"IFERROR(Scenarios!BB33,\"\")","v":0},{"$f":"IFERROR(Scenarios!BC33,\"\")","v":0},{"$f":"IFERROR(Scenarios!BD33,\"\")","v":0},{"$f":"IFERROR(Scenarios!BE33,\"\")","v":0},{"$f":"IFERROR(Scenarios!BF33,\"\")","v":0},{"$f":"IFERROR(Scenarios!BG33,\"\")","v":0},{"$f":"IFERROR(Scenarios!BH33,\"\")","v":0},{"$f":"IFERROR(Scenarios!BI33,\"\")","v":0},{"$f":"IFERROR(Scenarios!BJ33,\"\")","v":0},{"$f":"IFERROR(Scenarios!BK33,\"\")","v":0},{"$f":"IFERROR(Scenarios!BL33,\"\")","v":0},{"$f":"IFERROR(Scenarios!BM33,\"\")","v":0},{"$f":"IFERROR(Scenarios!BN33,\"\")","v":0},{"$f":"IFERROR(Scenarios!BO33,\"\")","v":0},{"$f":"IFERROR(Scenarios!BP33,\"\")","v":0},{"$f":"IFERROR(Scenarios!BQ33,\"\")","v":0},{"$f":"IFERROR(Scenarios!BR33,\"\")","v":0},{"$f":"IFERROR(Scenarios!BS33,\"\")","v":0},{"$f":"IFERROR(Scenarios!BT33,\"\")","v":0},{"$f":"IFERROR(Scenarios!BU33,\"\")","v":0},{"$f":"IFERROR(Scenarios!BV33,\"\")","v":0},{"$f":"IFERROR(Scenarios!BW33,\"\")","v":0},{"$f":"IFERROR(Scenarios!BX33,\"\")","v":0},{"$f":"IFERROR(Scenarios!BY33,\"\")","v":0},{"$f":"IFERROR(Scenarios!BZ33,\"\")","v":0},{"$f":"IFERROR(Scenarios!CA33,\"\")","v":0},{"$f":"IFERROR(Scenarios!CB33,\"\")","v":0},{"$f":"IFERROR(Scenarios!CC33,\"\")","v":0},{"$f":"IFERROR(Scenarios!CD33,\"\")","v":0},{"$f":"IFERROR(Scenarios!CE33,\"\")","v":0},{"$f":"IFERROR(Scenarios!CF33,\"\")","v":0},{"$f":"IFERROR(Scenarios!CG33,\"\")","v":0},{"$f":"IFERROR(Scenarios!CH33,\"\")","v":0},{"$f":"IFERROR(Scenarios!CI33,\"\")","v":0},{"$f":"IFERROR(Scenarios!CJ33,\"\")","v":0},{"$f":"IFERROR(Scenarios!CK33,\"\")","v":0},{"$f":"IFERROR(Scenarios!CL33,\"\")","v":0},{"$f":"IFERROR(Scenarios!CM33,\"\")","v":0},{"$f":"IFERROR(Scenarios!CN33,\"\")","v":0},{"$f":"IFERROR(Scenarios!CO33,\"\")","v":0},{"$f":"IFERROR(Scenarios!CP33,\"\")","v":0},{"$f":"IFERROR(Scenarios!CQ33,\"\")","v":0},{"$f":"IFERROR(Scenarios!CR33,\"\")","v":0},{"$f":"IFERROR(Scenarios!CS33,\"\")","v":0},{"$f":"IFERROR(Scenarios!CT33,\"\")","v":0},{"$f":"IFERROR(Scenarios!CU33,\"\")","v":0},{"$f":"IFERROR(Scenarios!CV33,\"\")","v":0},{"$f":"IFERROR(Scenarios!CW33,\"\")","v":0},{"$f":"IFERROR(Scenarios!CX33,\"\")","v":0},{"$f":"IFERROR(Scenarios!CY33,\"\")","v":0},{"$f":"IFERROR(Scenarios!CZ33,\"\")","v":0},{"$f":"IFERROR(Scenarios!DA33,\"\")","v":0}]
[{"$f":"IFERROR(Scenarios!A34,\"\")","v":0},{"$f":"IFERROR(Scenarios!B34,\"\")","v":0},{"$f":"IFERROR(Scenarios!C34,\"\")","v":0},{"$f":"IFERROR(Scenarios!D34,\"\")","v":0},{"$f":"IFERROR(Scenarios!E34,\"\")","v":0},{"$f":"IFERROR(Scenarios!F34,\"\")","v":0},{"$f":"IFERROR(Scenarios!G34,\"\")","v":0},{"$f":"IFERROR(Scenarios!H34,\"\")","v":0},{"$f":"IFERROR(Scenarios!I34,\"\")","v":0},{"$f":"IFERROR(Scenarios!J34,\"\")","v":0},{"$f":"IFERROR(Scenarios!K34,\"\")","v":0},{"$f":"IFERROR(Scenarios!L34,\"\")","v":0},{"$f":"IFERROR(Scenarios!M34,\"\")","v":0},{"$f":"IFERROR(Scenarios!N34,\"\")","v":0},{"$f":"IFERROR(Scenarios!O34,\"\")","v":0},{"$f":"IFERROR(Scenarios!P34,\"\")","v":0},{"$f":"IFERROR(Scenarios!Q34,\"\")","v":0},{"$f":"IFERROR(Scenarios!R34,\"\")","v":0},{"$f":"IFERROR(Scenarios!S34,\"\")","v":0},{"$f":"IFERROR(Scenarios!T34,\"\")","v":0},{"$f":"IFERROR(Scenarios!U34,\"\")","v":0},{"$f":"IFERROR(Scenarios!V34,\"\")","v":0},{"$f":"IFERROR(Scenarios!W34,\"\")","v":0},{"$f":"IFERROR(Scenarios!X34,\"\")","v":0},{"$f":"IFERROR(Scenarios!Y34,\"\")","v":0},{"$f":"IFERROR(Scenarios!Z34,\"\")","v":0},{"$f":"IFERROR(Scenarios!AA34,\"\")","v":0},{"$f":"IFERROR(Scenarios!AB34,\"\")","v":0},{"$f":"IFERROR(Scenarios!AC34,\"\")","v":0},{"$f":"IFERROR(Scenarios!AD34,\"\")","v":0},{"$f":"IFERROR(Scenarios!AE34,\"\")","v":0},{"$f":"IFERROR(Scenarios!AF34,\"\")","v":0},{"$f":"IFERROR(Scenarios!AG34,\"\")","v":0},{"$f":"IFERROR(Scenarios!AH34,\"\")","v":0},{"$f":"IFERROR(Scenarios!AI34,\"\")","v":0},{"$f":"IFERROR(Scenarios!AJ34,\"\")","v":0},{"$f":"IFERROR(Scenarios!AK34,\"\")","v":0},{"$f":"IFERROR(Scenarios!AL34,\"\")","v":0},{"$f":"IFERROR(Scenarios!AM34,\"\")","v":0},{"$f":"IFERROR(Scenarios!AN34,\"\")","v":0},{"$f":"IFERROR(Scenarios!AO34,\"\")","v":0},{"$f":"IFERROR(Scenarios!AP34,\"\")","v":0},{"$f":"IFERROR(Scenarios!AQ34,\"\")","v":0},{"$f":"IFERROR(Scenarios!AR34,\"\")","v":0},{"$f":"IFERROR(Scenarios!AS34,\"\")","v":0},{"$f":"IFERROR(Scenarios!AT34,\"\")","v":0},{"$f":"IFERROR(Scenarios!AU34,\"\")","v":0},{"$f":"IFERROR(Scenarios!AV34,\"\")","v":0},{"$f":"IFERROR(Scenarios!AW34,\"\")","v":0},{"$f":"IFERROR(Scenarios!AX34,\"\")","v":0},{"$f":"IFERROR(Scenarios!AY34,\"\")","v":0},{"$f":"IFERROR(Scenarios!AZ34,\"\")","v":0},{"$f":"IFERROR(Scenarios!BA34,\"\")","v":0},{"$f":"IFERROR(Scenarios!BB34,\"\")","v":0},{"$f":"IFERROR(Scenarios!BC34,\"\")","v":0},{"$f":"IFERROR(Scenarios!BD34,\"\")","v":0},{"$f":"IFERROR(Scenarios!BE34,\"\")","v":0},{"$f":"IFERROR(Scenarios!BF34,\"\")","v":0},{"$f":"IFERROR(Scenarios!BG34,\"\")","v":0},{"$f":"IFERROR(Scenarios!BH34,\"\")","v":0},{"$f":"IFERROR(Scenarios!BI34,\"\")","v":0},{"$f":"IFERROR(Scenarios!BJ34,\"\")","v":0},{"$f":"IFERROR(Scenarios!BK34,\"\")","v":0},{"$f":"IFERROR(Scenarios!BL34,\"\")","v":0},{"$f":"IFERROR(Scenarios!BM34,\"\")","v":0},{"$f":"IFERROR(Scenarios!BN34,\"\")","v":0},{"$f":"IFERROR(Scenarios!BO34,\"\")","v":0},{"$f":"IFERROR(Scenarios!BP34,\"\")","v":0},{"$f":"IFERROR(Scenarios!BQ34,\"\")","v":0},{"$f":"IFERROR(Scenarios!BR34,\"\")","v":0},{"$f":"IFERROR(Scenarios!BS34,\"\")","v":0},{"$f":"IFERROR(Scenarios!BT34,\"\")","v":0},{"$f":"IFERROR(Scenarios!BU34,\"\")","v":0},{"$f":"IFERROR(Scenarios!BV34,\"\")","v":0},{"$f":"IFERROR(Scenarios!BW34,\"\")","v":0},{"$f":"IFERROR(Scenarios!BX34,\"\")","v":0},{"$f":"IFERROR(Scenarios!BY34,\"\")","v":0},{"$f":"IFERROR(Scenarios!BZ34,\"\")","v":0},{"$f":"IFERROR(Scenarios!CA34,\"\")","v":0},{"$f":"IFERROR(Scenarios!CB34,\"\")","v":0},{"$f":"IFERROR(Scenarios!CC34,\"\")","v":0},{"$f":"IFERROR(Scenarios!CD34,\"\")","v":0},{"$f":"IFERROR(Scenarios!CE34,\"\")","v":0},{"$f":"IFERROR(Scenarios!CF34,\"\")","v":0},{"$f":"IFERROR(Scenarios!CG34,\"\")","v":0},{"$f":"IFERROR(Scenarios!CH34,\"\")","v":0},{"$f":"IFERROR(Scenarios!CI34,\"\")","v":0},{"$f":"IFERROR(Scenarios!CJ34,\"\")","v":0},{"$f":"IFERROR(Scenarios!CK34,\"\")","v":0},{"$f":"IFERROR(Scenarios!CL34,\"\")","v":0},{"$f":"IFERROR(Scenarios!CM34,\"\")","v":0},{"$f":"IFERROR(Scenarios!CN34,\"\")","v":0},{"$f":"IFERROR(Scenarios!CO34,\"\")","v":0},{"$f":"IFERROR(Scenarios!CP34,\"\")","v":0},{"$f":"IFERROR(Scenarios!CQ34,\"\")","v":0},{"$f":"IFERROR(Scenarios!CR34,\"\")","v":0},{"$f":"IFERROR(Scenarios!CS34,\"\")","v":0},{"$f":"IFERROR(Scenarios!CT34,\"\")","v":0},{"$f":"IFERROR(Scenarios!CU34,\"\")","v":0},{"$f":"IFERROR(Scenarios!CV34,\"\")","v":0},{"$f":"IFERROR(Scenarios!CW34,\"\")","v":0},{"$f":"IFERROR(Scenarios!CX34,\"\")","v":0},{"$f":"IFERROR(Scenarios!CY34,\"\")","v":0},{"$f":"IFERROR(Scenarios!CZ34,\"\")","v":0},{"$f":"IFERROR(Scenarios!DA34,\"\")","v":0}]
[{"$f":"IFERROR(Scenarios!A35,\"\")","v":0},{"$f":"IFERROR(Scenarios!B35,\"\")","v":0},{"$f":"IFERROR(Scenarios!C35,\"\")","v":0},{"$f":"IFERROR(Scenarios!D35,\"\")","v":0},{"$f":"IFERROR(Scenarios!E35,\"\")","v":0},{"$f":"IFERROR(Scenarios!F35,\"\")","v":0},{"$f":"IFERROR(Scenarios!G35,\"\")","v":0},{"$f":"IFERROR(Scenarios!H35,\"\")","v":0},{"$f":"IFERROR(Scenarios!I35,\"\")","v":0},{"$f":"IFERROR(Scenarios!J35,\"\")","v":0},{"$f":"IFERROR(Scenarios!K35,\"\")","v":0},{"$f":"IFERROR(Scenarios!L35,\"\")","v":0},{"$f":"IFERROR(Scenarios!M35,\"\")","v":0},{"$f":"IFERROR(Scenarios!N35,\"\")","v":0},{"$f":"IFERROR(Scenarios!O35,\"\")","v":0},{"$f":"IFERROR(Scenarios!P35,\"\")","v":0},{"$f":"IFERROR(Scenarios!Q35,\"\")","v":0},{"$f":"IFERROR(Scenarios!R35,\"\")","v":0},{"$f":"IFERROR(Scenarios!S35,\"\")","v":0},{"$f":"IFERROR(Scenarios!T35,\"\")","v":0},{"$f":"IFERROR(Scenarios!U35,\"\")","v":0},{"$f":"IFERROR(Scenarios!V35,\"\")","v":0},{"$f":"IFERROR(Scenarios!W35,\"\")","v":0},{"$f":"IFERROR(Scenarios!X35,\"\")","v":0},{"$f":"IFERROR(Scenarios!Y35,\"\")","v":0},{"$f":"IFERROR(Scenarios!Z35,\"\")","v":0},{"$f":"IFERROR(Scenarios!AA35,\"\")","v":0},{"$f":"IFERROR(Scenarios!AB35,\"\")","v":0},{"$f":"IFERROR(Scenarios!AC35,\"\")","v":0},{"$f":"IFERROR(Scenarios!AD35,\"\")","v":0},{"$f":"IFERROR(Scenarios!AE35,\"\")","v":0},{"$f":"IFERROR(Scenarios!AF35,\"\")","v":0},{"$f":"IFERROR(Scenarios!AG35,\"\")","v":0},{"$f":"IFERROR(Scenarios!AH35,\"\")","v":0},{"$f":"IFERROR(Scenarios!AI35,\"\")","v":0},{"$f":"IFERROR(Scenarios!AJ35,\"\")","v":0},{"$f":"IFERROR(Scenarios!AK35,\"\")","v":0},{"$f":"IFERROR(Scenarios!AL35,\"\")","v":0},{"$f":"IFERROR(Scenarios!AM35,\"\")","v":0},{"$f":"IFERROR(Scenarios!AN35,\"\")","v":0},{"$f":"IFERROR(Scenarios!AO35,\"\")","v":0},{"$f":"IFERROR(Scenarios!AP35,\"\")","v":0},{"$f":"IFERROR(Scenarios!AQ35,\"\")","v":0},{"$f":"IFERROR(Scenarios!AR35,\"\")","v":0},{"$f":"IFERROR(Scenarios!AS35,\"\")","v":0},{"$f":"IFERROR(Scenarios!AT35,\"\")","v":0},{"$f":"IFERROR(Scenarios!AU35,\"\")","v":0},{"$f":"IFERROR(Scenarios!AV35,\"\")","v":0},{"$f":"IFERROR(Scenarios!AW35,\"\")","v":0},{"$f":"IFERROR(Scenarios!AX35,\"\")","v":0},{"$f":"IFERROR(Scenarios!AY35,\"\")","v":0},{"$f":"IFERROR(Scenarios!AZ35,\"\")","v":0},{"$f":"IFERROR(Scenarios!BA35,\"\")","v":0},{"$f":"IFERROR(Scenarios!BB35,\"\")","v":0},{"$f":"IFERROR(Scenarios!BC35,\"\")","v":0},{"$f":"IFERROR(Scenarios!BD35,\"\")","v":0},{"$f":"IFERROR(Scenarios!BE35,\"\")","v":0},{"$f":"IFERROR(Scenarios!BF35,\"\")","v":0},{"$f":"IFERROR(Scenarios!BG35,\"\")","v":0},{"$f":"IFERROR(Scenarios!BH35,\"\")","v":0},{"$f":"IFERROR(Scenarios!BI35,\"\")","v":0},{"$f":"IFERROR(Scenarios!BJ35,\"\")","v":0},{"$f":"IFERROR(Scenarios!BK35,\"\")","v":0},{"$f":"IFERROR(Scenarios!BL35,\"\")","v":0},{"$f":"IFERROR(Scenarios!BM35,\"\")","v":0},{"$f":"IFERROR(Scenarios!BN35,\"\")","v":0},{"$f":"IFERROR(Scenarios!BO35,\"\")","v":0},{"$f":"IFERROR(Scenarios!BP35,\"\")","v":0},{"$f":"IFERROR(Scenarios!BQ35,\"\")","v":0},{"$f":"IFERROR(Scenarios!BR35,\"\")","v":0},{"$f":"IFERROR(Scenarios!BS35,\"\")","v":0},{"$f":"IFERROR(Scenarios!BT35,\"\")","v":0},{"$f":"IFERROR(Scenarios!BU35,\"\")","v":0},{"$f":"IFERROR(Scenarios!BV35,\"\")","v":0},{"$f":"IFERROR(Scenarios!BW35,\"\")","v":0},{"$f":"IFERROR(Scenarios!BX35,\"\")","v":0},{"$f":"IFERROR(Scenarios!BY35,\"\")","v":0},{"$f":"IFERROR(Scenarios!BZ35,\"\")","v":0},{"$f":"IFERROR(Scenarios!CA35,\"\")","v":0},{"$f":"IFERROR(Scenarios!CB35,\"\")","v":0},{"$f":"IFERROR(Scenarios!CC35,\"\")","v":0},{"$f":"IFERROR(Scenarios!CD35,\"\")","v":0},{"$f":"IFERROR(Scenarios!CE35,\"\")","v":0},{"$f":"IFERROR(Scenarios!CF35,\"\")","v":0},{"$f":"IFERROR(Scenarios!CG35,\"\")","v":0},{"$f":"IFERROR(Scenarios!CH35,\"\")","v":0},{"$f":"IFERROR(Scenarios!CI35,\"\")","v":0},{"$f":"IFERROR(Scenarios!CJ35,\"\")","v":0},{"$f":"IFERROR(Scenarios!CK35,\"\")","v":0},{"$f":"IFERROR(Scenarios!CL35,\"\")","v":0},{"$f":"IFERROR(Scenarios!CM35,\"\")","v":0},{"$f":"IFERROR(Scenarios!CN35,\"\")","v":0},{"$f":"IFERROR(Scenarios!CO35,\"\")","v":0},{"$f":"IFERROR(Scenarios!CP35,\"\")","v":0},{"$f":"IFERROR(Scenarios!CQ35,\"\")","v":0},{"$f":"IFERROR(Scenarios!CR35,\"\")","v":0},{"$f":"IFERROR(Scenarios!CS35,\"\")","v":0},{"$f":"IFERROR(Scenarios!CT35,\"\")","v":0},{"$f":"IFERROR(Scenarios!CU35,\"\")","v":0},{"$f":"IFERROR(Scenarios!CV35,\"\")","v":0},{"$f":"IFERROR(Scenarios!CW35,\"\")","v":0},{"$f":"IFERROR(Scenarios!CX35,\"\")","v":0},{"$f":"IFERROR(Scenarios!CY35,\"\")","v":0},{"$f":"IFERROR(Scenarios!CZ35,\"\")","v":0},{"$f":"IFERROR(Scenarios!DA35,\"\")","v":0}]
[{"$f":"IFERROR(Scenarios!A36,\"\")","v":0},{"$f":"IFERROR(Scenarios!B36,\"\")","v":0},{"$f":"IFERROR(Scenarios!C36,\"\")","v":0},{"$f":"IFERROR(Scenarios!D36,\"\")","v":0},{"$f":"IFERROR(Scenarios!E36,\"\")","v":0},{"$f":"IFERROR(Scenarios!F36,\"\")","v":0},{"$f":"IFERROR(Scenarios!G36,\"\")","v":0},{"$f":"IFERROR(Scenarios!H36,\"\")","v":0},{"$f":"IFERROR(Scenarios!I36,\"\")","v":0},{"$f":"IFERROR(Scenarios!J36,\"\")","v":0},{"$f":"IFERROR(Scenarios!K36,\"\")","v":0},{"$f":"IFERROR(Scenarios!L36,\"\")","v":0},{"$f":"IFERROR(Scenarios!M36,\"\")","v":0},{"$f":"IFERROR(Scenarios!N36,\"\")","v":0},{"$f":"IFERROR(Scenarios!O36,\"\")","v":0},{"$f":"IFERROR(Scenarios!P36,\"\")","v":0},{"$f":"IFERROR(Scenarios!Q36,\"\")","v":0},{"$f":"IFERROR(Scenarios!R36,\"\")","v":0},{"$f":"IFERROR(Scenarios!S36,\"\")","v":0},{"$f":"IFERROR(Scenarios!T36,\"\")","v":0},{"$f":"IFERROR(Scenarios!U36,\"\")","v":0},{"$f":"IFERROR(Scenarios!V36,\"\")","v":0},{"$f":"IFERROR(Scenarios!W36,\"\")","v":0},{"$f":"IFERROR(Scenarios!X36,\"\")","v":0},{"$f":"IFERROR(Scenarios!Y36,\"\")","v":0},{"$f":"IFERROR(Scenarios!Z36,\"\")","v":0},{"$f":"IFERROR(Scenarios!AA36,\"\")","v":0},{"$f":"IFERROR(Scenarios!AB36,\"\")","v":0},{"$f":"IFERROR(Scenarios!AC36,\"\")","v":0},{"$f":"IFERROR(Scenarios!AD36,\"\")","v":0},{"$f":"IFERROR(Scenarios!AE36,\"\")","v":0},{"$f":"IFERROR(Scenarios!AF36,\"\")","v":0},{"$f":"IFERROR(Scenarios!AG36,\"\")","v":0},{"$f":"IFERROR(Scenarios!AH36,\"\")","v":0},{"$f":"IFERROR(Scenarios!AI36,\"\")","v":0},{"$f":"IFERROR(Scenarios!AJ36,\"\")","v":0},{"$f":"IFERROR(Scenarios!AK36,\"\")","v":0},{"$f":"IFERROR(Scenarios!AL36,\"\")","v":0},{"$f":"IFERROR(Scenarios!AM36,\"\")","v":0},{"$f":"IFERROR(Scenarios!AN36,\"\")","v":0},{"$f":"IFERROR(Scenarios!AO36,\"\")","v":0},{"$f":"IFERROR(Scenarios!AP36,\"\")","v":0},{"$f":"IFERROR(Scenarios!AQ36,\"\")","v":0},{"$f":"IFERROR(Scenarios!AR36,\"\")","v":0},{"$f":"IFERROR(Scenarios!AS36,\"\")","v":0},{"$f":"IFERROR(Scenarios!AT36,\"\")","v":0},{"$f":"IFERROR(Scenarios!AU36,\"\")","v":0},{"$f":"IFERROR(Scenarios!AV36,\"\")","v":0},{"$f":"IFERROR(Scenarios!AW36,\"\")","v":0},{"$f":"IFERROR(Scenarios!AX36,\"\")","v":0},{"$f":"IFERROR(Scenarios!AY36,\"\")","v":0},{"$f":"IFERROR(Scenarios!AZ36,\"\")","v":0},{"$f":"IFERROR(Scenarios!BA36,\"\")","v":0},{"$f":"IFERROR(Scenarios!BB36,\"\")","v":0},{"$f":"IFERROR(Scenarios!BC36,\"\")","v":0},{"$f":"IFERROR(Scenarios!BD36,\"\")","v":0},{"$f":"IFERROR(Scenarios!BE36,\"\")","v":0},{"$f":"IFERROR(Scenarios!BF36,\"\")","v":0},{"$f":"IFERROR(Scenarios!BG36,\"\")","v":0},{"$f":"IFERROR(Scenarios!BH36,\"\")","v":0},{"$f":"IFERROR(Scenarios!BI36,\"\")","v":0},{"$f":"IFERROR(Scenarios!BJ36,\"\")","v":0},{"$f":"IFERROR(Scenarios!BK36,\"\")","v":0},{"$f":"IFERROR(Scenarios!BL36,\"\")","v":0},{"$f":"IFERROR(Scenarios!BM36,\"\")","v":0},{"$f":"IFERROR(Scenarios!BN36,\"\")","v":0},{"$f":"IFERROR(Scenarios!BO36,\"\")","v":0},{"$f":"IFERROR(Scenarios!BP36,\"\")","v":0},{"$f":"IFERROR(Scenarios!BQ36,\"\")","v":0},{"$f":"IFERROR(Scenarios!BR36,\"\")","v":0},{"$f":"IFERROR(Scenarios!BS36,\"\")","v":0},{"$f":"IFERROR(Scenarios!BT36,\"\")","v":0},{"$f":"IFERROR(Scenarios!BU36,\"\")","v":0},{"$f":"IFERROR(Scenarios!BV36,\"\")","v":0},{"$f":"IFERROR(Scenarios!BW36,\"\")","v":0},{"$f":"IFERROR(Scenarios!BX36,\"\")","v":0},{"$f":"IFERROR(Scenarios!BY36,\"\")","v":0},{"$f":"IFERROR(Scenarios!BZ36,\"\")","v":0},{"$f":"IFERROR(Scenarios!CA36,\"\")","v":0},{"$f":"IFERROR(Scenarios!CB36,\"\")","v":0},{"$f":"IFERROR(Scenarios!CC36,\"\")","v":0},{"$f":"IFERROR(Scenarios!CD36,\"\")","v":0},{"$f":"IFERROR(Scenarios!CE36,\"\")","v":0},{"$f":"IFERROR(Scenarios!CF36,\"\")","v":0},{"$f":"IFERROR(Scenarios!CG36,\"\")","v":0},{"$f":"IFERROR(Scenarios!CH36,\"\")","v":0},{"$f":"IFERROR(Scenarios!CI36,\"\")","v":0},{"$f":"IFERROR(Scenarios!CJ36,\"\")","v":0},{"$f":"IFERROR(Scenarios!CK36,\"\")","v":0},{"$f":"IFERROR(Scenarios!CL36,\"\")","v":0},{"$f":"IFERROR(Scenarios!CM36,\"\")","v":0},{"$f":"IFERROR(Scenarios!CN36,\"\")","v":0},{"$f":"IFERROR(Scenarios!CO36,\"\")","v":0},{"$f":"IFERROR(Scenarios!CP36,\"\")","v":0},{"$f":"IFERROR(Scenarios!CQ36,\"\")","v":0},{"$f":"IFERROR(Scenarios!CR36,\"\")","v":0},{"$f":"IFERROR(Scenarios!CS36,\"\")","v":0},{"$f":"IFERROR(Scenarios!CT36,\"\")","v":0},{"$f":"IFERROR(Scenarios!CU36,\"\")","v":0},{"$f":"IFERROR(Scenarios!CV36,\"\")","v":0},{"$f":"IFERROR(Scenarios!CW36,\"\")","v":0},{"$f":"IFERROR(Scenarios!CX36,\"\")","v":0},{"$f":"IFERROR(Scenarios!CY36,\"\")","v":0},{"$f":"IFERROR(Scenarios!CZ36,\"\")","v":0},{"$f":"IFERROR(Scenarios!DA36,\"\")","v":0}]
[{"$f":"IFERROR(Scenarios!A37,\"\")","v":0},{"$f":"IFERROR(Scenarios!B37,\"\")","v":0},{"$f":"IFERROR(Scenarios!C37,\"\")","v":0},{"$f":"IFERROR(Scenarios!D37,\"\")","v":0},{"$f":"IFERROR(Scenarios!E37,\"\")","v":0},{"$f":"IFERROR(Scenarios!F37,\"\")","v":0},{"$f":"IFERROR(Scenarios!G37,\"\")","v":0},{"$f":"IFERROR(Scenarios!H37,\"\")","v":0},{"$f":"IFERROR(Scenarios!I37,\"\")","v":0},{"$f":"IFERROR(Scenarios!J37,\"\")","v":0},{"$f":"IFERROR(Scenarios!K37,\"\")","v":0},{"$f":"IFERROR(Scenarios!L37,\"\")","v":0},{"$f":"IFERROR(Scenarios!M37,\"\")","v":0},{"$f":"IFERROR(Scenarios!N37,\"\")","v":0},{"$f":"IFERROR(Scenarios!O37,\"\")","v":0},{"$f":"IFERROR(Scenarios!P37,\"\")","v":0},{"$f":"IFERROR(Scenarios!Q37,\"\")","v":0},{"$f":"IFERROR(Scenarios!R37,\"\")","v":0},{"$f":"IFERROR(Scenarios!S37,\"\")","v":0},{"$f":"IFERROR(Scenarios!T37,\"\")","v":0},{"$f":"IFERROR(Scenarios!U37,\"\")","v":0},{"$f":"IFERROR(Scenarios!V37,\"\")","v":0},{"$f":"IFERROR(Scenarios!W37,\"\")","v":0},{"$f":"IFERROR(Scenarios!X37,\"\")","v":0},{"$f":"IFERROR(Scenarios!Y37,\"\")","v":0},{"$f":"IFERROR(Scenarios!Z37,\"\")","v":0},{"$f":"IFERROR(Scenarios!AA37,\"\")","v":0},{"$f":"IFERROR(Scenarios!AB37,\"\")","v":0},{"$f":"IFERROR(Scenarios!AC37,\"\")","v":0},{"$f":"IFERROR(Scenarios!AD37,\"\")","v":0},{"$f":"IFERROR(Scenarios!AE37,\"\")","v":0},{"$f":"IFERROR(Scenarios!AF37,\"\")","v":0},{"$f":"IFERROR(Scenarios!AG37,\"\")","v":0},{"$f":"IFERROR(Scenarios!AH37,\"\")","v":0},{"$f":"IFERROR(Scenarios!AI37,\"\")","v":0},{"$f":"IFERROR(Scenarios!AJ37,\"\")","v":0},{"$f":"IFERROR(Scenarios!AK37,\"\")","v":0},{"$f":"IFERROR(Scenarios!AL37,\"\")","v":0},{"$f":"IFERROR(Scenarios!AM37,\"\")","v":0},{"$f":"IFERROR(Scenarios!AN37,\"\")","v":0},{"$f":"IFERROR(Scenarios!AO37,\"\")","v":0},{"$f":"IFERROR(Scenarios!AP37,\"\")","v":0},{"$f":"IFERROR(Scenarios!AQ37,\"\")","v":0},{"$f":"IFERROR(Scenarios!AR37,\"\")","v":0},{"$f":"IFERROR(Scenarios!AS37,\"\")","v":0},{"$f":"IFERROR(Scenarios!AT37,\"\")","v":0},{"$f":"IFERROR(Scenarios!AU37,\"\")","v":0},{"$f":"IFERROR(Scenarios!AV37,\"\")","v":0},{"$f":"IFERROR(Scenarios!AW37,\"\")","v":0},{"$f":"IFERROR(Scenarios!AX37,\"\")","v":0},{"$f":"IFERROR(Scenarios!AY37,\"\")","v":0},{"$f":"IFERROR(Scenarios!AZ37,\"\")","v":0},{"$f":"IFERROR(Scenarios!BA37,\"\")","v":0},{"$f":"IFERROR(Scenarios!BB37,\"\")","v":0},{"$f":"IFERROR(Scenarios!BC37,\"\")","v":0},{"$f":"IFERROR(Scenarios!BD37,\"\")","v":0},{"$f":"IFERROR(Scenarios!BE37,\"\")","v":0},{"$f":"IFERROR(Scenarios!BF37,\"\")","v":0},{"$f":"IFERROR(Scenarios!BG37,\"\")","v":0},{"$f":"IFERROR(Scenarios!BH37,\"\")","v":0},{"$f":"IFERROR(Scenarios!BI37,\"\")","v":0},{"$f":"IFERROR(Scenarios!BJ37,\"\")","v":0},{"$f":"IFERROR(Scenarios!BK37,\"\")","v":0},{"$f":"IFERROR(Scenarios!BL37,\"\")","v":0},{"$f":"IFERROR(Scenarios!BM37,\"\")","v":0},{"$f":"IFERROR(Scenarios!BN37,\"\")","v":0},{"$f":"IFERROR(Scenarios!BO37,\"\")","v":0},{"$f":"IFERROR(Scenarios!BP37,\"\")","v":0},{"$f":"IFERROR(Scenarios!BQ37,\"\")","v":0},{"$f":"IFERROR(Scenarios!BR37,\"\")","v":0},{"$f":"IFERROR(Scenarios!BS37,\"\")","v":0},{"$f":"IFERROR(Scenarios!BT37,\"\")","v":0},{"$f":"IFERROR(Scenarios!BU37,\"\")","v":0},{"$f":"IFERROR(Scenarios!BV37,\"\")","v":0},{"$f":"IFERROR(Scenarios!BW37,\"\")","v":0},{"$f":"IFERROR(Scenarios!BX37,\"\")","v":0},{"$f":"IFERROR(Scenarios!BY37,\"\")","v":0},{"$f":"IFERROR(Scenarios!BZ37,\"\")","v":0},{"$f":"IFERROR(Scenarios!CA37,\"\")","v":0},{"$f":"IFERROR(Scenarios!CB37,\"\")","v":0},{"$f":"IFERROR(Scenarios!CC37,\"\")","v":0},{"$f":"IFERROR(Scenarios!CD37,\"\")","v":0},{"$f":"IFERROR(Scenarios!CE37,\"\")","v":0},{"$f":"IFERROR(Scenarios!CF37,\"\")","v":0},{"$f":"IFERROR(Scenarios!CG37,\"\")","v":0},{"$f":"IFERROR(Scenarios!CH37,\"\")","v":0},{"$f":"IFERROR(Scenarios!CI37,\"\")","v":0},{"$f":"IFERROR(Scenarios!CJ37,\"\")","v":0},{"$f":"IFERROR(Scenarios!CK37,\"\")","v":0},{"$f":"IFERROR(Scenarios!CL37,\"\")","v":0},{"$f":"IFERROR(Scenarios!CM37,\"\")","v":0},{"$f":"IFERROR(Scenarios!CN37,\"\")","v":0},{"$f":"IFERROR(Scenarios!CO37,\"\")","v":0},{"$f":"IFERROR(Scenarios!CP37,\"\")","v":0},{"$f":"IFERROR(Scenarios!CQ37,\"\")","v":0},{"$f":"IFERROR(Scenarios!CR37,\"\")","v":0},{"$f":"IFERROR(Scenarios!CS37,\"\")","v":0},{"$f":"IFERROR(Scenarios!CT37,\"\")","v":0},{"$f":"IFERROR(Scenarios!CU37,\"\")","v":0},{"$f":"IFERROR(Scenarios!CV37,\"\")","v":0},{"$f":"IFERROR(Scenarios!CW37,\"\")","v":0},{"$f":"IFERROR(Scenarios!CX37,\"\")","v":0},{"$f":"IFERROR(Scenarios!CY37,\"\")","v":0},{"$f":"IFERROR(Scenarios!CZ37,\"\")","v":0},{"$f":"IFERROR(Scenarios!DA37,\"\")","v":0}]
[{"$f":"IFERROR(Scenarios!A38,\"\")","v":0},{"$f":"IFERROR(Scenarios!B38,\"\")","v":0},{"$f":"IFERROR(Scenarios!C38,\"\")","v":0},{"$f":"IFERROR(Scenarios!D38,\"\")","v":0},{"$f":"IFERROR(Scenarios!E38,\"\")","v":0},{"$f":"IFERROR(Scenarios!F38,\"\")","v":0},{"$f":"IFERROR(Scenarios!G38,\"\")","v":0},{"$f":"IFERROR(Scenarios!H38,\"\")","v":0},{"$f":"IFERROR(Scenarios!I38,\"\")","v":0},{"$f":"IFERROR(Scenarios!J38,\"\")","v":0},{"$f":"IFERROR(Scenarios!K38,\"\")","v":0},{"$f":"IFERROR(Scenarios!L38,\"\")","v":0},{"$f":"IFERROR(Scenarios!M38,\"\")","v":0},{"$f":"IFERROR(Scenarios!N38,\"\")","v":0},{"$f":"IFERROR(Scenarios!O38,\"\")","v":0},{"$f":"IFERROR(Scenarios!P38,\"\")","v":0},{"$f":"IFERROR(Scenarios!Q38,\"\")","v":0},{"$f":"IFERROR(Scenarios!R38,\"\")","v":0},{"$f":"IFERROR(Scenarios!S38,\"\")","v":0},{"$f":"IFERROR(Scenarios!T38,\"\")","v":0},{"$f":"IFERROR(Scenarios!U38,\"\")","v":0},{"$f":"IFERROR(Scenarios!V38,\"\")","v":0},{"$f":"IFERROR(Scenarios!W38,\"\")","v":0},{"$f":"IFERROR(Scenarios!X38,\"\")","v":0},{"$f":"IFERROR(Scenarios!Y38,\"\")","v":0},{"$f":"IFERROR(Scenarios!Z38,\"\")","v":0},{"$f":"IFERROR(Scenarios!AA38,\"\")","v":0},{"$f":"IFERROR(Scenarios!AB38,\"\")","v":0},{"$f":"IFERROR(Scenarios!AC38,\"\")","v":0},{"$f":"IFERROR(Scenarios!AD38,\"\")","v":0},{"$f":"IFERROR(Scenarios!AE38,\"\")","v":0},{"$f":"IFERROR(Scenarios!AF38,\"\")","v":0},{"$f":"IFERROR(Scenarios!AG38,\"\")","v":0},{"$f":"IFERROR(Scenarios!AH38,\"\")","v":0},{"$f":"IFERROR(Scenarios!AI38,\"\")","v":0},{"$f":"IFERROR(Scenarios!AJ38,\"\")","v":0},{"$f":"IFERROR(Scenarios!AK38,\"\")","v":0},{"$f":"IFERROR(Scenarios!AL38,\"\")","v":0},{"$f":"IFERROR(Scenarios!AM38,\"\")","v":0},{"$f":"IFERROR(Scenarios!AN38,\"\")","v":0},{"$f":"IFERROR(Scenarios!AO38,\"\")","v":0},{"$f":"IFERROR(Scenarios!AP38,\"\")","v":0},{"$f":"IFERROR(Scenarios!AQ38,\"\")","v":0},{"$f":"IFERROR(Scenarios!AR38,\"\")","v":0},{"$f":"IFERROR(Scenarios!AS38,\"\")","v":0},{"$f":"IFERROR(Scenarios!AT38,\"\")","v":0},{"$f":"IFERROR(Scenarios!AU38,\"\")","v":0},{"$f":"IFERROR(Scenarios!AV38,\"\")","v":0},{"$f":"IFERROR(Scenarios!AW38,\"\")","v":0},{"$f":"IFERROR(Scenarios!AX38,\"\")","v":0},{"$f":"IFERROR(Scenarios!AY38,\"\")","v":0},{"$f":"IFERROR(Scenarios!AZ38,\"\")","v":0},{"$f":"IFERROR(Scenarios!BA38,\"\")","v":0},{"$f":"IFERROR(Scenarios!BB38,\"\")","v":0},{"$f":"IFERROR(Scenarios!BC38,\"\")","v":0},{"$f":"IFERROR(Scenarios!BD38,\"\")","v":0},{"$f":"IFERROR(Scenarios!BE38,\"\")","v":0},{"$f":"IFERROR(Scenarios!BF38,\"\")","v":0},{"$f":"IFERROR(Scenarios!BG38,\"\")","v":0},{"$f":"IFERROR(Scenarios!BH38,\"\")","v":0},{"$f":"IFERROR(Scenarios!BI38,\"\")","v":0},{"$f":"IFERROR(Scenarios!BJ38,\"\")","v":0},{"$f":"IFERROR(Scenarios!BK38,\"\")","v":0},{"$f":"IFERROR(Scenarios!BL38,\"\")","v":0},{"$f":"IFERROR(Scenarios!BM38,\"\")","v":0},{"$f":"IFERROR(Scenarios!BN38,\"\")","v":0},{"$f":"IFERROR(Scenarios!BO38,\"\")","v":0},{"$f":"IFERROR(Scenarios!BP38,\"\")","v":0},{"$f":"IFERROR(Scenarios!BQ38,\"\")","v":0},{"$f":"IFERROR(Scenarios!BR38,\"\")","v":0},{"$f":"IFERROR(Scenarios!BS38,\"\")","v":0},{"$f":"IFERROR(Scenarios!BT38,\"\")","v":0},{"$f":"IFERROR(Scenarios!BU38,\"\")","v":0},{"$f":"IFERROR(Scenarios!BV38,\"\")","v":0},{"$f":"IFERROR(Scenarios!BW38,\"\")","v":0},{"$f":"IFERROR(Scenarios!BX38,\"\")","v":0},{"$f":"IFERROR(Scenarios!BY38,\"\")","v":0},{"$f":"IFERROR(Scenarios!BZ38,\"\")","v":0},{"$f":"IFERROR(Scenarios!CA38,\"\")","v":0},{"$f":"IFERROR(Scenarios!CB38,\"\")","v":0},{"$f":"IFERROR(Scenarios!CC38,\"\")","v":0},{"$f":"IFERROR(Scenarios!CD38,\"\")","v":0},{"$f":"IFERROR(Scenarios!CE38,\"\")","v":0},{"$f":"IFERROR(Scenarios!CF38,\"\")","v":0},{"$f":"IFERROR(Scenarios!CG38,\"\")","v":0},{"$f":"IFERROR(Scenarios!CH38,\"\")","v":0},{"$f":"IFERROR(Scenarios!CI38,\"\")","v":0},{"$f":"IFERROR(Scenarios!CJ38,\"\")","v":0},{"$f":"IFERROR(Scenarios!CK38,\"\")","v":0},{"$f":"IFERROR(Scenarios!CL38,\"\")","v":0},{"$f":"IFERROR(Scenarios!CM38,\"\")","v":0},{"$f":"IFERROR(Scenarios!CN38,\"\")","v":0},{"$f":"IFERROR(Scenarios!CO38,\"\")","v":0},{"$f":"IFERROR(Scenarios!CP38,\"\")","v":0},{"$f":"IFERROR(Scenarios!CQ38,\"\")","v":0},{"$f":"IFERROR(Scenarios!CR38,\"\")","v":0},{"$f":"IFERROR(Scenarios!CS38,\"\")","v":0},{"$f":"IFERROR(Scenarios!CT38,\"\")","v":0},{"$f":"IFERROR(Scenarios!CU38,\"\")","v":0},{"$f":"IFERROR(Scenarios!CV38,\"\")","v":0},{"$f":"IFERROR(Scenarios!CW38,\"\")","v":0},{"$f":"IFERROR(Scenarios!CX38,\"\")","v":0},{"$f":"IFERROR(Scenarios!CY38,\"\")","v":0},{"$f":"IFERROR(Scenarios!CZ38,\"\")","v":0},{"$f":"IFERROR(Scenarios!DA38,\"\")","v":0}]
[{"$f":"IFERROR(Scenarios!A39,\"\")","v":0},{"$f":"IFERROR(Scenarios!B39,\"\")","v":0},{"$f":"IFERROR(Scenarios!C39,\"\")","v":0},{"$f":"IFERROR(Scenarios!D39,\"\")","v":0},{"$f":"IFERROR(Scenarios!E39,\"\")","v":0},{"$f":"IFERROR(Scenarios!F39,\"\")","v":0},{"$f":"IFERROR(Scenarios!G39,\"\")","v":0},{"$f":"IFERROR(Scenarios!H39,\"\")","v":0},{"$f":"IFERROR(Scenarios!I39,\"\")","v":0},{"$f":"IFERROR(Scenarios!J39,\"\")","v":0},{"$f":"IFERROR(Scenarios!K39,\"\")","v":0},{"$f":"IFERROR(Scenarios!L39,\"\")","v":0},{"$f":"IFERROR(Scenarios!M39,\"\")","v":0},{"$f":"IFERROR(Scenarios!N39,\"\")","v":0},{"$f":"IFERROR(Scenarios!O39,\"\")","v":0},{"$f":"IFERROR(Scenarios!P39,\"\")","v":0},{"$f":"IFERROR(Scenarios!Q39,\"\")","v":0},{"$f":"IFERROR(Scenarios!R39,\"\")","v":0},{"$f":"IFERROR(Scenarios!S39,\"\")","v":0},{"$f":"IFERROR(Scenarios!T39,\"\")","v":0},{"$f":"IFERROR(Scenarios!U39,\"\")","v":0},{"$f":"IFERROR(Scenarios!V39,\"\")","v":0},{"$f":"IFERROR(Scenarios!W39,\"\")","v":0},{"$f":"IFERROR(Scenarios!X39,\"\")","v":0},{"$f":"IFERROR(Scenarios!Y39,\"\")","v":0},{"$f":"IFERROR(Scenarios!Z39,\"\")","v":0},{"$f":"IFERROR(Scenarios!AA39,\"\")","v":0},{"$f":"IFERROR(Scenarios!AB39,\"\")","v":0},{"$f":"IFERROR(Scenarios!AC39,\"\")","v":0},{"$f":"IFERROR(Scenarios!AD39,\"\")","v":0},{"$f":"IFERROR(Scenarios!AE39,\"\")","v":0},{"$f":"IFERROR(Scenarios!AF39,\"\")","v":0},{"$f":"IFERROR(Scenarios!AG39,\"\")","v":0},{"$f":"IFERROR(Scenarios!AH39,\"\")","v":0},{"$f":"IFERROR(Scenarios!AI39,\"\")","v":0},{"$f":"IFERROR(Scenarios!AJ39,\"\")","v":0},{"$f":"IFERROR(Scenarios!AK39,\"\")","v":0},{"$f":"IFERROR(Scenarios!AL39,\"\")","v":0},{"$f":"IFERROR(Scenarios!AM39,\"\")","v":0},{"$f":"IFERROR(Scenarios!AN39,\"\")","v":0},{"$f":"IFERROR(Scenarios!AO39,\"\")","v":0},{"$f":"IFERROR(Scenarios!AP39,\"\")","v":0},{"$f":"IFERROR(Scenarios!AQ39,\"\")","v":0},{"$f":"IFERROR(Scenarios!AR39,\"\")","v":0},{"$f":"IFERROR(Scenarios!AS39,\"\")","v":0},{"$f":"IFERROR(Scenarios!AT39,\"\")","v":0},{"$f":"IFERROR(Scenarios!AU39,\"\")","v":0},{"$f":"IFERROR(Scenarios!AV39,\"\")","v":0},{"$f":"IFERROR(Scenarios!AW39,\"\")","v":0},{"$f":"IFERROR(Scenarios!AX39,\"\")","v":0},{"$f":"IFERROR(Scenarios!AY39,\"\")","v":0},{"$f":"IFERROR(Scenarios!AZ39,\"\")","v":0},{"$f":"IFERROR(Scenarios!BA39,\"\")","v":0},{"$f":"IFERROR(Scenarios!BB39,\"\")","v":0},{"$f":"IFERROR(Scenarios!BC39,\"\")","v":0},{"$f":"IFERROR(Scenarios!BD39,\"\")","v":0},{"$f":"IFERROR(Scenarios!BE39,\"\")","v":0},{"$f":"IFERROR(Scenarios!BF39,\"\")","v":0},{"$f":"IFERROR(Scenarios!BG39,\"\")","v":0},{"$f":"IFERROR(Scenarios!BH39,\"\")","v":0},{"$f":"IFERROR(Scenarios!BI39,\"\")","v":0},{"$f":"IFERROR(Scenarios!BJ39,\"\")","v":0},{"$f":"IFERROR(Scenarios!BK39,\"\")","v":0},{"$f":"IFERROR(Scenarios!BL39,\"\")","v":0},{"$f":"IFERROR(Scenarios!BM39,\"\")","v":0},{"$f":"IFERROR(Scenarios!BN39,\"\")","v":0},{"$f":"IFERROR(Scenarios!BO39,\"\")","v":0},{"$f":"IFERROR(Scenarios!BP39,\"\")","v":0},{"$f":"IFERROR(Scenarios!BQ39,\"\")","v":0},{"$f":"IFERROR(Scenarios!BR39,\"\")","v":0},{"$f":"IFERROR(Scenarios!BS39,\"\")","v":0},{"$f":"IFERROR(Scenarios!BT39,\"\")","v":0},{"$f":"IFERROR(Scenarios!BU39,\"\")","v":0},{"$f":"IFERROR(Scenarios!BV39,\"\")","v":0},{"$f":"IFERROR(Scenarios!BW39,\"\")","v":0},{"$f":"IFERROR(Scenarios!BX39,\"\")","v":0},{"$f":"IFERROR(Scenarios!BY39,\"\")","v":0},{"$f":"IFERROR(Scenarios!BZ39,\"\")","v":0},{"$f":"IFERROR(Scenarios!CA39,\"\")","v":0},{"$f":"IFERROR(Scenarios!CB39,\"\")","v":0},{"$f":"IFERROR(Scenarios!CC39,\"\")","v":0},{"$f":"IFERROR(Scenarios!CD39,\"\")","v":0},{"$f":"IFERROR(Scenarios!CE39,\"\")","v":0},{"$f":"IFERROR(Scenarios!CF39,\"\")","v":0},{"$f":"IFERROR(Scenarios!CG39,\"\")","v":0},{"$f":"IFERROR(Scenarios!CH39,\"\")","v":0},{"$f":"IFERROR(Scenarios!CI39,\"\")","v":0},{"$f":"IFERROR(Scenarios!CJ39,\"\")","v":0},{"$f":"IFERROR(Scenarios!CK39,\"\")","v":0},{"$f":"IFERROR(Scenarios!CL39,\"\")","v":0},{"$f":"IFERROR(Scenarios!CM39,\"\")","v":0},{"$f":"IFERROR(Scenarios!CN39,\"\")","v":0},{"$f":"IFERROR(Scenarios!CO39,\"\")","v":0},{"$f":"IFERROR(Scenarios!CP39,\"\")","v":0},{"$f":"IFERROR(Scenarios!CQ39,\"\")","v":0},{"$f":"IFERROR(Scenarios!CR39,\"\")","v":0},{"$f":"IFERROR(Scenarios!CS39,\"\")","v":0},{"$f":"IFERROR(Scenarios!CT39,\"\")","v":0},{"$f":"IFERROR(Scenarios!CU39,\"\")","v":0},{"$f":"IFERROR(Scenarios!CV39,\"\")","v":0},{"$f":"IFERROR(Scenarios!CW39,\"\")","v":0},{"$f":"IFERROR(Scenarios!CX39,\"\")","v":0},{"$f":"IFERROR(Scenarios!CY39,\"\")","v":0},{"$f":"IFERROR(Scenarios!CZ39,\"\")","v":0},{"$f":"IFERROR(Scenarios!DA39,\"\")","v":0}]
[{"$f":"IFERROR(Scenarios!A40,\"\")","v":0},{"$f":"IFERROR(Scenarios!B40,\"\")","v":0},{"$f":"IFERROR(Scenarios!C40,\"\")","v":0},{"$f":"IFERROR(Scenarios!D40,\"\")","v":0},{"$f":"IFERROR(Scenarios!E40,\"\")","v":0},{"$f":"IFERROR(Scenarios!F40,\"\")","v":0},{"$f":"IFERROR(Scenarios!G40,\"\")","v":0},{"$f":"IFERROR(Scenarios!H40,\"\")","v":0},{"$f":"IFERROR(Scenarios!I40,\"\")","v":0},{"$f":"IFERROR(Scenarios!J40,\"\")","v":0},{"$f":"IFERROR(Scenarios!K40,\"\")","v":0},{"$f":"IFERROR(Scenarios!L40,\"\")","v":0},{"$f":"IFERROR(Scenarios!M40,\"\")","v":0},{"$f":"IFERROR(Scenarios!N40,\"\")","v":0},{"$f":"IFERROR(Scenarios!O40,\"\")","v":0},{"$f":"IFERROR(Scenarios!P40,\"\")","v":0},{"$f":"IFERROR(Scenarios!Q40,\"\")","v":0},{"$f":"IFERROR(Scenarios!R40,\"\")","v":0},{"$f":"IFERROR(Scenarios!S40,\"\")","v":0},{"$f":"IFERROR(Scenarios!T40,\"\")","v":0},{"$f":"IFERROR(Scenarios!U40,\"\")","v":0},{"$f":"IFERROR(Scenarios!V40,\"\")","v":0},{"$f":"IFERROR(Scenarios!W40,\"\")","v":0},{"$f":"IFERROR(Scenarios!X40,\"\")","v":0},{"$f":"IFERROR(Scenarios!Y40,\"\")","v":0},{"$f":"IFERROR(Scenarios!Z40,\"\")","v":0},{"$f":"IFERROR(Scenarios!AA40,\"\")","v":0},{"$f":"IFERROR(Scenarios!AB40,\"\")","v":0},{"$f":"IFERROR(Scenarios!AC40,\"\")","v":0},{"$f":"IFERROR(Scenarios!AD40,\"\")","v":0},{"$f":"IFERROR(Scenarios!AE40,\"\")","v":0},{"$f":"IFERROR(Scenarios!AF40,\"\")","v":0},{"$f":"IFERROR(Scenarios!AG40,\"\")","v":0},{"$f":"IFERROR(Scenarios!AH40,\"\")","v":0},{"$f":"IFERROR(Scenarios!AI40,\"\")","v":0},{"$f":"IFERROR(Scenarios!AJ40,\"\")","v":0},{"$f":"IFERROR(Scenarios!AK40,\"\")","v":0},{"$f":"IFERROR(Scenarios!AL40,\"\")","v":0},{"$f":"IFERROR(Scenarios!AM40,\"\")","v":0},{"$f":"IFERROR(Scenarios!AN40,\"\")","v":0},{"$f":"IFERROR(Scenarios!AO40,\"\")","v":0},{"$f":"IFERROR(Scenarios!AP40,\"\")","v":0},{"$f":"IFERROR(Scenarios!AQ40,\"\")","v":0},{"$f":"IFERROR(Scenarios!AR40,\"\")","v":0},{"$f":"IFERROR(Scenarios!AS40,\"\")","v":0},{"$f":"IFERROR(Scenarios!AT40,\"\")","v":0},{"$f":"IFERROR(Scenarios!AU40,\"\")","v":0},{"$f":"IFERROR(Scenarios!AV40,\"\")","v":0},{"$f":"IFERROR(Scenarios!AW40,\"\")","v":0},{"$f":"IFERROR(Scenarios!AX40,\"\")","v":0},{"$f":"IFERROR(Scenarios!AY40,\"\")","v":0},{"$f":"IFERROR(Scenarios!AZ40,\"\")","v":0},{"$f":"IFERROR(Scenarios!BA40,\"\")","v":0},{"$f":"IFERROR(Scenarios!BB40,\"\")","v":0},{"$f":"IFERROR(Scenarios!BC40,\"\")","v":0},{"$f":"IFERROR(Scenarios!BD40,\"\")","v":0},{"$f":"IFERROR(Scenarios!BE40,\"\")","v":0},{"$f":"IFERROR(Scenarios!BF40,\"\")","v":0},{"$f":"IFERROR(Scenarios!BG40,\"\")","v":0},{"$f":"IFERROR(Scenarios!BH40,\"\")","v":0},{"$f":"IFERROR(Scenarios!BI40,\"\")","v":0},{"$f":"IFERROR(Scenarios!BJ40,\"\")","v":0},{"$f":"IFERROR(Scenarios!BK40,\"\")","v":0},{"$f":"IFERROR(Scenarios!BL40,\"\")","v":0},{"$f":"IFERROR(Scenarios!BM40,\"\")","v":0},{"$f":"IFERROR(Scenarios!BN40,\"\")","v":0},{"$f":"IFERROR(Scenarios!BO40,\"\")","v":0},{"$f":"IFERROR(Scenarios!BP40,\"\")","v":0},{"$f":"IFERROR(Scenarios!BQ40,\"\")","v":0},{"$f":"IFERROR(Scenarios!BR40,\"\")","v":0},{"$f":"IFERROR(Scenarios!BS40,\"\")","v":0},{"$f":"IFERROR(Scenarios!BT40,\"\")","v":0},{"$f":"IFERROR(Scenarios!BU40,\"\")","v":0},{"$f":"IFERROR(Scenarios!BV40,\"\")","v":0},{"$f":"IFERROR(Scenarios!BW40,\"\")","v":0},{"$f":"IFERROR(Scenarios!BX40,\"\")","v":0},{"$f":"IFERROR(Scenarios!BY40,\"\")","v":0},{"$f":"IFERROR(Scenarios!BZ40,\"\")","v":0},{"$f":"IFERROR(Scenarios!CA40,\"\")","v":0},{"$f":"IFERROR(Scenarios!CB40,\"\")","v":0},{"$f":"IFERROR(Scenarios!CC40,\"\")","v":0},{"$f":"IFERROR(Scenarios!CD40,\"\")","v":0},{"$f":"IFERROR(Scenarios!CE40,\"\")","v":0},{"$f":"IFERROR(Scenarios!CF40,\"\")","v":0},{"$f":"IFERROR(Scenarios!CG40,\"\")","v":0},{"$f":"IFERROR(Scenarios!CH40,\"\")","v":0},{"$f":"IFERROR(Scenarios!CI40,\"\")","v":0},{"$f":"IFERROR(Scenarios!CJ40,\"\")","v":0},{"$f":"IFERROR(Scenarios!CK40,\"\")","v":0},{"$f":"IFERROR(Scenarios!CL40,\"\")","v":0},{"$f":"IFERROR(Scenarios!CM40,\"\")","v":0},{"$f":"IFERROR(Scenarios!CN40,\"\")","v":0},{"$f":"IFERROR(Scenarios!CO40,\"\")","v":0},{"$f":"IFERROR(Scenarios!CP40,\"\")","v":0},{"$f":"IFERROR(Scenarios!CQ40,\"\")","v":0},{"$f":"IFERROR(Scenarios!CR40,\"\")","v":0},{"$f":"IFERROR(Scenarios!CS40,\"\")","v":0},{"$f":"IFERROR(Scenarios!CT40,\"\")","v":0},{"$f":"IFERROR(Scenarios!CU40,\"\")","v":0},{"$f":"IFERROR(Scenarios!CV40,\"\")","v":0},{"$f":"IFERROR(Scenarios!CW40,\"\")","v":0},{"$f":"IFERROR(Scenarios!CX40,\"\")","v":0},{"$f":"IFERROR(Scenarios!CY40,\"\")","v":0},{"$f":"IFERROR(Scenarios!CZ40,\"\")","v":0},{"$f":"IFERROR(Scenarios!DA40,\"\")","v":0}]
[{"$f":"IFERROR(Scenarios!A41,\"\")","v":0},{"$f":"IFERROR(Scenarios!B41,\"\")","v":0},{"$f":"IFERROR(Scenarios!C41,\"\")","v":0},{"$f":"IFERROR(Scenarios!D41,\"\")","v":0},{"$f":"IFERROR(Scenarios!E41,\"\")","v":0},{"$f":"IFERROR(Scenarios!F41,\"\")","v":0},{"$f":"IFERROR(Scenarios!G41,\"\")","v":0},{"$f":"IFERROR(Scenarios!H41,\"\")","v":0},{"$f":"IFERROR(Scenarios!I41,\"\")","v":0},{"$f":"IFERROR(Scenarios!J41,\"\")","v":0},{"$f":"IFERROR(Scenarios!K41,\"\")","v":0},{"$f":"IFERROR(Scenarios!L41,\"\")","v":0},{"$f":"IFERROR(Scenarios!M41,\"\")","v":0},{"$f":"IFERROR(Scenarios!N41,\"\")","v":0},{"$f":"IFERROR(Scenarios!O41,\"\")","v":0},{"$f":"IFERROR(Scenarios!P41,\"\")","v":0},{"$f":"IFERROR(Scenarios!Q41,\"\")","v":0},{"$f":"IFERROR(Scenarios!R41,\"\")","v":0},{"$f":"IFERROR(Scenarios!S41,\"\")","v":0},{"$f":"IFERROR(Scenarios!T41,\"\")","v":0},{"$f":"IFERROR(Scenarios!U41,\"\")","v":0},{"$f":"IFERROR(Scenarios!V41,\"\")","v":0},{"$f":"IFERROR(Scenarios!W41,\"\")","v":0},{"$f":"IFERROR(Scenarios!X41,\"\")","v":0},{"$f":"IFERROR(Scenarios!Y41,\"\")","v":0},{"$f":"IFERROR(Scenarios!Z41,\"\")","v":0},{"$f":"IFERROR(Scenarios!AA41,\"\")","v":0},{"$f":"IFERROR(Scenarios!AB41,\"\")","v":0},{"$f":"IFERROR(Scenarios!AC41,\"\")","v":0},{"$f":"IFERROR(Scenarios!AD41,\"\")","v":0},{"$f":"IFERROR(Scenarios!AE41,\"\")","v":0},{"$f":"IFERROR(Scenarios!AF41,\"\")","v":0},{"$f":"IFERROR(Scenarios!AG41,\"\")","v":0},{"$f":"IFERROR(Scenarios!AH41,\"\")","v":0},{"$f":"IFERROR(Scenarios!AI41,\"\")","v":0},{"$f":"IFERROR(Scenarios!AJ41,\"\")","v":0},{"$f":"IFERROR(Scenarios!AK41,\"\")","v":0},{"$f":"IFERROR(Scenarios!AL41,\"\")","v":0},{"$f":"IFERROR(Scenarios!AM41,\"\")","v":0},{"$f":"IFERROR(Scenarios!AN41,\"\")","v":0},{"$f":"IFERROR(Scenarios!AO41,\"\")","v":0},{"$f":"IFERROR(Scenarios!AP41,\"\")","v":0},{"$f":"IFERROR(Scenarios!AQ41,\"\")","v":0},{"$f":"IFERROR(Scenarios!AR41,\"\")","v":0},{"$f":"IFERROR(Scenarios!AS41,\"\")","v":0},{"$f":"IFERROR(Scenarios!AT41,\"\")","v":0},{"$f":"IFERROR(Scenarios!AU41,\"\")","v":0},{"$f":"IFERROR(Scenarios!AV41,\"\")","v":0},{"$f":"IFERROR(Scenarios!AW41,\"\")","v":0},{"$f":"IFERROR(Scenarios!AX41,\"\")","v":0},{"$f":"IFERROR(Scenarios!AY41,\"\")","v":0},{"$f":"IFERROR(Scenarios!AZ41,\"\")","v":0},{"$f":"IFERROR(Scenarios!BA41,\"\")","v":0},{"$f":"IFERROR(Scenarios!BB41,\"\")","v":0},{"$f":"IFERROR(Scenarios!BC41,\"\")","v":0},{"$f":"IFERROR(Scenarios!BD41,\"\")","v":0},{"$f":"IFERROR(Scenarios!BE41,\"\")","v":0},{"$f":"IFERROR(Scenarios!BF41,\"\")","v":0},{"$f":"IFERROR(Scenarios!BG41,\"\")","v":0},{"$f":"IFERROR(Scenarios!BH41,\"\")","v":0},{"$f":"IFERROR(Scenarios!BI41,\"\")","v":0},{"$f":"IFERROR(Scenarios!BJ41,\"\")","v":0},{"$f":"IFERROR(Scenarios!BK41,\"\")","v":0},{"$f":"IFERROR(Scenarios!BL41,\"\")","v":0},{"$f":"IFERROR(Scenarios!BM41,\"\")","v":0},{"$f":"IFERROR(Scenarios!BN41,\"\")","v":0},{"$f":"IFERROR(Scenarios!BO41,\"\")","v":0},{"$f":"IFERROR(Scenarios!BP41,\"\")","v":0},{"$f":"IFERROR(Scenarios!BQ41,\"\")","v":0},{"$f":"IFERROR(Scenarios!BR41,\"\")","v":0},{"$f":"IFERROR(Scenarios!BS41,\"\")","v":0},{"$f":"IFERROR(Scenarios!BT41,\"\")","v":0},{"$f":"IFERROR(Scenarios!BU41,\"\")","v":0},{"$f":"IFERROR(Scenarios!BV41,\"\")","v":0},{"$f":"IFERROR(Scenarios!BW41,\"\")","v":0},{"$f":"IFERROR(Scenarios!BX41,\"\")","v":0},{"$f":"IFERROR(Scenarios!BY41,\"\")","v":0},{"$f":"IFERROR(Scenarios!BZ41,\"\")","v":0},{"$f":"IFERROR(Scenarios!CA41,\"\")","v":0},{"$f":"IFERROR(Scenarios!CB41,\"\")","v":0},{"$f":"IFERROR(Scenarios!CC41,\"\")","v":0},{"$f":"IFERROR(Scenarios!CD41,\"\")","v":0},{"$f":"IFERROR(Scenarios!CE41,\"\")","v":0},{"$f":"IFERROR(Scenarios!CF41,\"\")","v":0},{"$f":"IFERROR(Scenarios!CG41,\"\")","v":0},{"$f":"IFERROR(Scenarios!CH41,\"\")","v":0},{"$f":"IFERROR(Scenarios!CI41,\"\")","v":0},{"$f":"IFERROR(Scenarios!CJ41,\"\")","v":0},{"$f":"IFERROR(Scenarios!CK41,\"\")","v":0},{"$f":"IFERROR(Scenarios!CL41,\"\")","v":0},{"$f":"IFERROR(Scenarios!CM41,\"\")","v":0},{"$f":"IFERROR(Scenarios!CN41,\"\")","v":0},{"$f":"IFERROR(Scenarios!CO41,\"\")","v":0},{"$f":"IFERROR(Scenarios!CP41,\"\")","v":0},{"$f":"IFERROR(Scenarios!CQ41,\"\")","v":0},{"$f":"IFERROR(Scenarios!CR41,\"\")","v":0},{"$f":"IFERROR(Scenarios!CS41,\"\")","v":0},{"$f":"IFERROR(Scenarios!CT41,\"\")","v":0},{"$f":"IFERROR(Scenarios!CU41,\"\")","v":0},{"$f":"IFERROR(Scenarios!CV41,\"\")","v":0},{"$f":"IFERROR(Scenarios!CW41,\"\")","v":0},{"$f":"IFERROR(Scenarios!CX41,\"\")","v":0},{"$f":"IFERROR(Scenarios!CY41,\"\")","v":0},{"$f":"IFERROR(Scenarios!CZ41,\"\")","v":0},{"$f":"IFERROR(Scenarios!DA41,\"\")","v":0}]
[{"$f":"IFERROR(Scenarios!A42,\"\")","v":0},{"$f":"IFERROR(Scenarios!B42,\"\")","v":0},{"$f":"IFERROR(Scenarios!C42,\"\")","v":0},{"$f":"IFERROR(Scenarios!D42,\"\")","v":0},{"$f":"IFERROR(Scenarios!E42,\"\")","v":0},{"$f":"IFERROR(Scenarios!F42,\"\")","v":0},{"$f":"IFERROR(Scenarios!G42,\"\")","v":0},{"$f":"IFERROR(Scenarios!H42,\"\")","v":0},{"$f":"IFERROR(Scenarios!I42,\"\")","v":0},{"$f":"IFERROR(Scenarios!J42,\"\")","v":0},{"$f":"IFERROR(Scenarios!K42,\"\")","v":0},{"$f":"IFERROR(Scenarios!L42,\"\")","v":0},{"$f":"IFERROR(Scenarios!M42,\"\")","v":0},{"$f":"IFERROR(Scenarios!N42,\"\")","v":0},{"$f":"IFERROR(Scenarios!O42,\"\")","v":0},{"$f":"IFERROR(Scenarios!P42,\"\")","v":0},{"$f":"IFERROR(Scenarios!Q42,\"\")","v":0},{"$f":"IFERROR(Scenarios!R42,\"\")","v":0},{"$f":"IFERROR(Scenarios!S42,\"\")","v":0},{"$f":"IFERROR(Scenarios!T42,\"\")","v":0},{"$f":"IFERROR(Scenarios!U42,\"\")","v":0},{"$f":"IFERROR(Scenarios!V42,\"\")","v":0},{"$f":"IFERROR(Scenarios!W42,\"\")","v":0},{"$f":"IFERROR(Scenarios!X42,\"\")","v":0},{"$f":"IFERROR(Scenarios!Y42,\"\")","v":0},{"$f":"IFERROR(Scenarios!Z42,\"\")","v":0},{"$f":"IFERROR(Scenarios!AA42,\"\")","v":0},{"$f":"IFERROR(Scenarios!AB42,\"\")","v":0},{"$f":"IFERROR(Scenarios!AC42,\"\")","v":0},{"$f":"IFERROR(Scenarios!AD42,\"\")","v":0},{"$f":"IFERROR(Scenarios!AE42,\"\")","v":0},{"$f":"IFERROR(Scenarios!AF42,\"\")","v":0},{"$f":"IFERROR(Scenarios!AG42,\"\")","v":0},{"$f":"IFERROR(Scenarios!AH42,\"\")","v":0},{"$f":"IFERROR(Scenarios!AI42,\"\")","v":0},{"$f":"IFERROR(Scenarios!AJ42,\"\")","v":0},{"$f":"IFERROR(Scenarios!AK42,\"\")","v":0},{"$f":"IFERROR(Scenarios!AL42,\"\")","v":0},{"$f":"IFERROR(Scenarios!AM42,\"\")","v":0},{"$f":"IFERROR(Scenarios!AN42,\"\")","v":0},{"$f":"IFERROR(Scenarios!AO42,\"\")","v":0},{"$f":"IFERROR(Scenarios!AP42,\"\")","v":0},{"$f":"IFERROR(Scenarios!AQ42,\"\")","v":0},{"$f":"IFERROR(Scenarios!AR42,\"\")","v":0},{"$f":"IFERROR(Scenarios!AS42,\"\")","v":0},{"$f":"IFERROR(Scenarios!AT42,\"\")","v":0},{"$f":"IFERROR(Scenarios!AU42,\"\")","v":0},{"$f":"IFERROR(Scenarios!AV42,\"\")","v":0},{"$f":"IFERROR(Scenarios!AW42,\"\")","v":0},{"$f":"IFERROR(Scenarios!AX42,\"\")","v":0},{"$f":"IFERROR(Scenarios!AY42,\"\")","v":0},{"$f":"IFERROR(Scenarios!AZ42,\"\")","v":0},{"$f":"IFERROR(Scenarios!BA42,\"\")","v":0},{"$f":"IFERROR(Scenarios!BB42,\"\")","v":0},{"$f":"IFERROR(Scenarios!BC42,\"\")","v":0},{"$f":"IFERROR(Scenarios!BD42,\"\")","v":0},{"$f":"IFERROR(Scenarios!BE42,\"\")","v":0},{"$f":"IFERROR(Scenarios!BF42,\"\")","v":0},{"$f":"IFERROR(Scenarios!BG42,\"\")","v":0},{"$f":"IFERROR(Scenarios!BH42,\"\")","v":0},{"$f":"IFERROR(Scenarios!BI42,\"\")","v":0},{"$f":"IFERROR(Scenarios!BJ42,\"\")","v":0},{"$f":"IFERROR(Scenarios!BK42,\"\")","v":0},{"$f":"IFERROR(Scenarios!BL42,\"\")","v":0},{"$f":"IFERROR(Scenarios!BM42,\"\")","v":0},{"$f":"IFERROR(Scenarios!BN42,\"\")","v":0},{"$f":"IFERROR(Scenarios!BO42,\"\")","v":0},{"$f":"IFERROR(Scenarios!BP42,\"\")","v":0},{"$f":"IFERROR(Scenarios!BQ42,\"\")","v":0},{"$f":"IFERROR(Scenarios!BR42,\"\")","v":0},{"$f":"IFERROR(Scenarios!BS42,\"\")","v":0},{"$f":"IFERROR(Scenarios!BT42,\"\")","v":0},{"$f":"IFERROR(Scenarios!BU42,\"\")","v":0},{"$f":"IFERROR(Scenarios!BV42,\"\")","v":0},{"$f":"IFERROR(Scenarios!BW42,\"\")","v":0},{"$f":"IFERROR(Scenarios!BX42,\"\")","v":0},{"$f":"IFERROR(Scenarios!BY42,\"\")","v":0},{"$f":"IFERROR(Scenarios!BZ42,\"\")","v":0},{"$f":"IFERROR(Scenarios!CA42,\"\")","v":0},{"$f":"IFERROR(Scenarios!CB42,\"\")","v":0},{"$f":"IFERROR(Scenarios!CC42,\"\")","v":0},{"$f":"IFERROR(Scenarios!CD42,\"\")","v":0},{"$f":"IFERROR(Scenarios!CE42,\"\")","v":0},{"$f":"IFERROR(Scenarios!CF42,\"\")","v":0},{"$f":"IFERROR(Scenarios!CG42,\"\")","v":0},{"$f":"IFERROR(Scenarios!CH42,\"\")","v":0},{"$f":"IFERROR(Scenarios!CI42,\"\")","v":0},{"$f":"IFERROR(Scenarios!CJ42,\"\")","v":0},{"$f":"IFERROR(Scenarios!CK42,\"\")","v":0},{"$f":"IFERROR(Scenarios!CL42,\"\")","v":0},{"$f":"IFERROR(Scenarios!CM42,\"\")","v":0},{"$f":"IFERROR(Scenarios!CN42,\"\")","v":0},{"$f":"IFERROR(Scenarios!CO42,\"\")","v":0},{"$f":"IFERROR(Scenarios!CP42,\"\")","v":0},{"$f":"IFERROR(Scenarios!CQ42,\"\")","v":0},{"$f":"IFERROR(Scenarios!CR42,\"\")","v":0},{"$f":"IFERROR(Scenarios!CS42,\"\")","v":0},{"$f":"IFERROR(Scenarios!CT42,\"\")","v":0},{"$f":"IFERROR(Scenarios!CU42,\"\")","v":0},{"$f":"IFERROR(Scenarios!CV42,\"\")","v":0},{"$f":"IFERROR(Scenarios!CW42,\"\")","v":0},{"$f":"IFERROR(Scenarios!CX42,\"\")","v":0},{"$f":"IFERROR(Scenarios!CY42,\"\")","v":0},{"$f":"IFERROR(Scenarios!CZ42,\"\")","v":0},{"$f":"IFERROR(Scenarios!DA42,\"\")","v":0}]
[{"$f":"IFERROR(Scenarios!A43,\"\")","v":0},{"$f":"IFERROR(Scenarios!B43,\"\")","v":0},{"$f":"IFERROR(Scenarios!C43,\"\")","v":0},{"$f":"IFERROR(Scenarios!D43,\"\")","v":0},{"$f":"IFERROR(Scenarios!E43,\"\")","v":0},{"$f":"IFERROR(Scenarios!F43,\"\")","v":0},{"$f":"IFERROR(Scenarios!G43,\"\")","v":0},{"$f":"IFERROR(Scenarios!H43,\"\")","v":0},{"$f":"IFERROR(Scenarios!I43,\"\")","v":0},{"$f":"IFERROR(Scenarios!J43,\"\")","v":0},{"$f":"IFERROR(Scenarios!K43,\"\")","v":0},{"$f":"IFERROR(Scenarios!L43,\"\")","v":0},{"$f":"IFERROR(Scenarios!M43,\"\")","v":0},{"$f":"IFERROR(Scenarios!N43,\"\")","v":0},{"$f":"IFERROR(Scenarios!O43,\"\")","v":0},{"$f":"IFERROR(Scenarios!P43,\"\")","v":0},{"$f":"IFERROR(Scenarios!Q43,\"\")","v":0},{"$f":"IFERROR(Scenarios!R43,\"\")","v":0},{"$f":"IFERROR(Scenarios!S43,\"\")","v":0},{"$f":"IFERROR(Scenarios!T43,\"\")","v":0},{"$f":"IFERROR(Scenarios!U43,\"\")","v":0},{"$f":"IFERROR(Scenarios!V43,\"\")","v":0},{"$f":"IFERROR(Scenarios!W43,\"\")","v":0},{"$f":"IFERROR(Scenarios!X43,\"\")","v":0},{"$f":"IFERROR(Scenarios!Y43,\"\")","v":0},{"$f":"IFERROR(Scenarios!Z43,\"\")","v":0},{"$f":"IFERROR(Scenarios!AA43,\"\")","v":0},{"$f":"IFERROR(Scenarios!AB43,\"\")","v":0},{"$f":"IFERROR(Scenarios!AC43,\"\")","v":0},{"$f":"IFERROR(Scenarios!AD43,\"\")","v":0},{"$f":"IFERROR(Scenarios!AE43,\"\")","v":0},{"$f":"IFERROR(Scenarios!AF43,\"\")","v":0},{"$f":"IFERROR(Scenarios!AG43,\"\")","v":0},{"$f":"IFERROR(Scenarios!AH43,\"\")","v":0},{"$f":"IFERROR(Scenarios!AI43,\"\")","v":0},{"$f":"IFERROR(Scenarios!AJ43,\"\")","v":0},{"$f":"IFERROR(Scenarios!AK43,\"\")","v":0},{"$f":"IFERROR(Scenarios!AL43,\"\")","v":0},{"$f":"IFERROR(Scenarios!AM43,\"\")","v":0},{"$f":"IFERROR(Scenarios!AN43,\"\")","v":0},{"$f":"IFERROR(Scenarios!AO43,\"\")","v":0},{"$f":"IFERROR(Scenarios!AP43,\"\")","v":0},{"$f":"IFERROR(Scenarios!AQ43,\"\")","v":0},{"$f":"IFERROR(Scenarios!AR43,\"\")","v":0},{"$f":"IFERROR(Scenarios!AS43,\"\")","v":0},{"$f":"IFERROR(Scenarios!AT43,\"\")","v":0},{"$f":"IFERROR(Scenarios!AU43,\"\")","v":0},{"$f":"IFERROR(Scenarios!AV43,\"\")","v":0},{"$f":"IFERROR(Scenarios!AW43,\"\")","v":0},{"$f":"IFERROR(Scenarios!AX43,\"\")","v":0},{"$f":"IFERROR(Scenarios!AY43,\"\")","v":0},{"$f":"IFERROR(Scenarios!AZ43,\"\")","v":0},{"$f":"IFERROR(Scenarios!BA43,\"\")","v":0},{"$f":"IFERROR(Scenarios!BB43,\"\")","v":0},{"$f":"IFERROR(Scenarios!BC43,\"\")","v":0},{"$f":"IFERROR(Scenarios!BD43,\"\")","v":0},{"$f":"IFERROR(Scenarios!BE43,\"\")","v":0},{"$f":"IFERROR(Scenarios!BF43,\"\")","v":0},{"$f":"IFERROR(Scenarios!BG43,\"\")","v":0},{"$f":"IFERROR(Scenarios!BH43,\"\")","v":0},{"$f":"IFERROR(Scenarios!BI43,\"\")","v":0},{"$f":"IFERROR(Scenarios!BJ43,\"\")","v":0},{"$f":"IFERROR(Scenarios!BK43,\"\")","v":0},{"$f":"IFERROR(Scenarios!BL43,\"\")","v":0},{"$f":"IFERROR(Scenarios!BM43,\"\")","v":0},{"$f":"IFERROR(Scenarios!BN43,\"\")","v":0},{"$f":"IFERROR(Scenarios!BO43,\"\")","v":0},{"$f":"IFERROR(Scenarios!BP43,\"\")","v":0},{"$f":"IFERROR(Scenarios!BQ43,\"\")","v":0},{"$f":"IFERROR(Scenarios!BR43,\"\")","v":0},{"$f":"IFERROR(Scenarios!BS43,\"\")","v":0},{"$f":"IFERROR(Scenarios!BT43,\"\")","v":0},{"$f":"IFERROR(Scenarios!BU43,\"\")","v":0},{"$f":"IFERROR(Scenarios!BV43,\"\")","v":0},{"$f":"IFERROR(Scenarios!BW43,\"\")","v":0},{"$f":"IFERROR(Scenarios!BX43,\"\")","v":0},{"$f":"IFERROR(Scenarios!BY43,\"\")","v":0},{"$f":"IFERROR(Scenarios!BZ43,\"\")","v":0},{"$f":"IFERROR(Scenarios!CA43,\"\")","v":0},{"$f":"IFERROR(Scenarios!CB43,\"\")","v":0},{"$f":"IFERROR(Scenarios!CC43,\"\")","v":0},{"$f":"IFERROR(Scenarios!CD43,\"\")","v":0},{"$f":"IFERROR(Scenarios!CE43,\"\")","v":0},{"$f":"IFERROR(Scenarios!CF43,\"\")","v":0},{"$f":"IFERROR(Scenarios!CG43,\"\")","v":0},{"$f":"IFERROR(Scenarios!CH43,\"\")","v":0},{"$f":"IFERROR(Scenarios!CI43,\"\")","v":0},{"$f":"IFERROR(Scenarios!CJ43,\"\")","v":0},{"$f":"IFERROR(Scenarios!CK43,\"\")","v":0},{"$f":"IFERROR(Scenarios!CL43,\"\")","v":0},{"$f":"IFERROR(Scenarios!CM43,\"\")","v":0},{"$f":"IFERROR(Scenarios!CN43,\"\")","v":0},{"$f":"IFERROR(Scenarios!CO43,\"\")","v":0},{"$f":"IFERROR(Scenarios!CP43,\"\")","v":0},{"$f":"IFERROR(Scenarios!CQ43,\"\")","v":0},{"$f":"IFERROR(Scenarios!CR43,\"\")","v":0},{"$f":"IFERROR(Scenarios!CS43,\"\")","v":0},{"$f":"IFERROR(Scenarios!CT43,\"\")","v":0},{"$f":"IFERROR(Scenarios!CU43,\"\")","v":0},{"$f":"IFERROR(Scenarios!CV43,\"\")","v":0},{"$f":"IFERROR(Scenarios!CW43,\"\")","v":0},{"$f":"IFERROR(Scenarios!CX43,\"\")","v":0},{"$f":"IFERROR(Scenarios!CY43,\"\")","v":0},{"$f":"IFERROR(Scenarios!CZ43,\"\")","v":0},{"$f":"IFERROR(Scenarios!DA43,\"\")","v":0}]
[{"$f":"IFERROR(Scenarios!A44,\"\")","v":0},{"$f":"IFERROR(Scenarios!B44,\"\")","v":0},{"$f":"IFERROR(Scenarios!C44,\"\")","v":0},{"$f":"IFERROR(Scenarios!D44,\"\")","v":0},{"$f":"IFERROR(Scenarios!E44,\"\")","v":0},{"$f":"IFERROR(Scenarios!F44,\"\")","v":0},{"$f":"IFERROR(Scenarios!G44,\"\")","v":0},{"$f":"IFERROR(Scenarios!H44,\"\")","v":0},{"$f":"IFERROR(Scenarios!I44,\"\")","v":0},{"$f":"IFERROR(Scenarios!J44,\"\")","v":0},{"$f":"IFERROR(Scenarios!K44,\"\")","v":0},{"$f":"IFERROR(Scenarios!L44,\"\")","v":0},{"$f":"IFERROR(Scenarios!M44,\"\")","v":0},{"$f":"IFERROR(Scenarios!N44,\"\")","v":0},{"$f":"IFERROR(Scenarios!O44,\"\")","v":0},{"$f":"IFERROR(Scenarios!P44,\"\")","v":0},{"$f":"IFERROR(Scenarios!Q44,\"\")","v":0},{"$f":"IFERROR(Scenarios!R44,\"\")","v":0},{"$f":"IFERROR(Scenarios!S44,\"\")","v":0},{"$f":"IFERROR(Scenarios!T44,\"\")","v":0},{"$f":"IFERROR(Scenarios!U44,\"\")","v":0},{"$f":"IFERROR(Scenarios!V44,\"\")","v":0},{"$f":"IFERROR(Scenarios!W44,\"\")","v":0},{"$f":"IFERROR(Scenarios!X44,\"\")","v":0},{"$f":"IFERROR(Scenarios!Y44,\"\")","v":0},{"$f":"IFERROR(Scenarios!Z44,\"\")","v":0},{"$f":"IFERROR(Scenarios!AA44,\"\")","v":0},{"$f":"IFERROR(Scenarios!AB44,\"\")","v":0},{"$f":"IFERROR(Scenarios!AC44,\"\")","v":0},{"$f":"IFERROR(Scenarios!AD44,\"\")","v":0},{"$f":"IFERROR(Scenarios!AE44,\"\")","v":0},{"$f":"IFERROR(Scenarios!AF44,\"\")","v":0},{"$f":"IFERROR(Scenarios!AG44,\"\")","v":0},{"$f":"IFERROR(Scenarios!AH44,\"\")","v":0},{"$f":"IFERROR(Scenarios!AI44,\"\")","v":0},{"$f":"IFERROR(Scenarios!AJ44,\"\")","v":0},{"$f":"IFERROR(Scenarios!AK44,\"\")","v":0},{"$f":"IFERROR(Scenarios!AL44,\"\")","v":0},{"$f":"IFERROR(Scenarios!AM44,\"\")","v":0},{"$f":"IFERROR(Scenarios!AN44,\"\")","v":0},{"$f":"IFERROR(Scenarios!AO44,\"\")","v":0},{"$f":"IFERROR(Scenarios!AP44,\"\")","v":0},{"$f":"IFERROR(Scenarios!AQ44,\"\")","v":0},{"$f":"IFERROR(Scenarios!AR44,\"\")","v":0},{"$f":"IFERROR(Scenarios!AS44,\"\")","v":0},{"$f":"IFERROR(Scenarios!AT44,\"\")","v":0},{"$f":"IFERROR(Scenarios!AU44,\"\")","v":0},{"$f":"IFERROR(Scenarios!AV44,\"\")","v":0},{"$f":"IFERROR(Scenarios!AW44,\"\")","v":0},{"$f":"IFERROR(Scenarios!AX44,\"\")","v":0},{"$f":"IFERROR(Scenarios!AY44,\"\")","v":0},{"$f":"IFERROR(Scenarios!AZ44,\"\")","v":0},{"$f":"IFERROR(Scenarios!BA44,\"\")","v":0},{"$f":"IFERROR(Scenarios!BB44,\"\")","v":0},{"$f":"IFERROR(Scenarios!BC44,\"\")","v":0},{"$f":"IFERROR(Scenarios!BD44,\"\")","v":0},{"$f":"IFERROR(Scenarios!BE44,\"\")","v":0},{"$f":"IFERROR(Scenarios!BF44,\"\")","v":0},{"$f":"IFERROR(Scenarios!BG44,\"\")","v":0},{"$f":"IFERROR(Scenarios!BH44,\"\")","v":0},{"$f":"IFERROR(Scenarios!BI44,\"\")","v":0},{"$f":"IFERROR(Scenarios!BJ44,\"\")","v":0},{"$f":"IFERROR(Scenarios!BK44,\"\")","v":0},{"$f":"IFERROR(Scenarios!BL44,\"\")","v":0},{"$f":"IFERROR(Scenarios!BM44,\"\")","v":0},{"$f":"IFERROR(Scenarios!BN44,\"\")","v":0},{"$f":"IFERROR(Scenarios!BO44,\"\")","v":0},{"$f":"IFERROR(Scenarios!BP44,\"\")","v":0},{"$f":"IFERROR(Scenarios!BQ44,\"\")","v":0},{"$f":"IFERROR(Scenarios!BR44,\"\")","v":0},{"$f":"IFERROR(Scenarios!BS44,\"\")","v":0},{"$f":"IFERROR(Scenarios!BT44,\"\")","v":0},{"$f":"IFERROR(Scenarios!BU44,\"\")","v":0},{"$f":"IFERROR(Scenarios!BV44,\"\")","v":0},{"$f":"IFERROR(Scenarios!BW44,\"\")","v":0},{"$f":"IFERROR(Scenarios!BX44,\"\")","v":0},{"$f":"IFERROR(Scenarios!BY44,\"\")","v":0},{"$f":"IFERROR(Scenarios!BZ44,\"\")","v":0},{"$f":"IFERROR(Scenarios!CA44,\"\")","v":0},{"$f":"IFERROR(Scenarios!CB44,\"\")","v":0},{"$f":"IFERROR(Scenarios!CC44,\"\")","v":0},{"$f":"IFERROR(Scenarios!CD44,\"\")","v":0},{"$f":"IFERROR(Scenarios!CE44,\"\")","v":0},{"$f":"IFERROR(Scenarios!CF44,\"\")","v":0},{"$f":"IFERROR(Scenarios!CG44,\"\")","v":0},{"$f":"IFERROR(Scenarios!CH44,\"\")","v":0},{"$f":"IFERROR(Scenarios!CI44,\"\")","v":0},{"$f":"IFERROR(Scenarios!CJ44,\"\")","v":0},{"$f":"IFERROR(Scenarios!CK44,\"\")","v":0},{"$f":"IFERROR(Scenarios!CL44,\"\")","v":0},{"$f":"IFERROR(Scenarios!CM44,\"\")","v":0},{"$f":"IFERROR(Scenarios!CN44,\"\")","v":0},{"$f":"IFERROR(Scenarios!CO44,\"\")","v":0},{"$f":"IFERROR(Scenarios!CP44,\"\")","v":0},{"$f":"IFERROR(Scenarios!CQ44,\"\")","v":0},{"$f":"IFERROR(Scenarios!CR44,\"\")","v":0},{"$f":"IFERROR(Scenarios!CS44,\"\")","v":0},{"$f":"IFERROR(Scenarios!CT44,\"\")","v":0},{"$f":"IFERROR(Scenarios!CU44,\"\")","v":0},{"$f":"IFERROR(Scenarios!CV44,\"\")","v":0},{"$f":"IFERROR(Scenarios!CW44,\"\")","v":0},{"$f":"IFERROR(Scenarios!CX44,\"\")","v":0},{"$f":"IFERROR(Scenarios!CY44,\"\")","v":0},{"$f":"IFERROR(Scenarios!CZ44,\"\")","v":0},{"$f":"IFERROR(Scenarios!DA44,\"\")","v":0}]
[{"$f":"IFERROR(Scenarios!A45,\"\")","v":0},{"$f":"IFERROR(Scenarios!B45,\"\")","v":0},{"$f":"IFERROR(Scenarios!C45,\"\")","v":0},{"$f":"IFERROR(Scenarios!D45,\"\")","v":0},{"$f":"IFERROR(Scenarios!E45,\"\")","v":0},{"$f":"IFERROR(Scenarios!F45,\"\")","v":0},{"$f":"IFERROR(Scenarios!G45,\"\")","v":0},{"$f":"IFERROR(Scenarios!H45,\"\")","v":0},{"$f":"IFERROR(Scenarios!I45,\"\")","v":0},{"$f":"IFERROR(Scenarios!J45,\"\")","v":0},{"$f":"IFERROR(Scenarios!K45,\"\")","v":0},{"$f":"IFERROR(Scenarios!L45,\"\")","v":0},{"$f":"IFERROR(Scenarios!M45,\"\")","v":0},{"$f":"IFERROR(Scenarios!N45,\"\")","v":0},{"$f":"IFERROR(Scenarios!O45,\"\")","v":0},{"$f":"IFERROR(Scenarios!P45,\"\")","v":0},{"$f":"IFERROR(Scenarios!Q45,\"\")","v":0},{"$f":"IFERROR(Scenarios!R45,\"\")","v":0},{"$f":"IFERROR(Scenarios!S45,\"\")","v":0},{"$f":"IFERROR(Scenarios!T45,\"\")","v":0},{"$f":"IFERROR(Scenarios!U45,\"\")","v":0},{"$f":"IFERROR(Scenarios!V45,\"\")","v":0},{"$f":"IFERROR(Scenarios!W45,\"\")","v":0},{"$f":"IFERROR(Scenarios!X45,\"\")","v":0},{"$f":"IFERROR(Scenarios!Y45,\"\")","v":0},{"$f":"IFERROR(Scenarios!Z45,\"\")","v":0},{"$f":"IFERROR(Scenarios!AA45,\"\")","v":0},{"$f":"IFERROR(Scenarios!AB45,\"\")","v":0},{"$f":"IFERROR(Scenarios!AC45,\"\")","v":0},{"$f":"IFERROR(Scenarios!AD45,\"\")","v":0},{"$f":"IFERROR(Scenarios!AE45,\"\")","v":0},{"$f":"IFERROR(Scenarios!AF45,\"\")","v":0},{"$f":"IFERROR(Scenarios!AG45,\"\")","v":0},{"$f":"IFERROR(Scenarios!AH45,\"\")","v":0},{"$f":"IFERROR(Scenarios!AI45,\"\")","v":0},{"$f":"IFERROR(Scenarios!AJ45,\"\")","v":0},{"$f":"IFERROR(Scenarios!AK45,\"\")","v":0},{"$f":"IFERROR(Scenarios!AL45,\"\")","v":0},{"$f":"IFERROR(Scenarios!AM45,\"\")","v":0},{"$f":"IFERROR(Scenarios!AN45,\"\")","v":0},{"$f":"IFERROR(Scenarios!AO45,\"\")","v":0},{"$f":"IFERROR(Scenarios!AP45,\"\")","v":0},{"$f":"IFERROR(Scenarios!AQ45,\"\")","v":0},{"$f":"IFERROR(Scenarios!AR45,\"\")","v":0},{"$f":"IFERROR(Scenarios!AS45,\"\")","v":0},{"$f":"IFERROR(Scenarios!AT45,\"\")","v":0},{"$f":"IFERROR(Scenarios!AU45,\"\")","v":0},{"$f":"IFERROR(Scenarios!AV45,\"\")","v":0},{"$f":"IFERROR(Scenarios!AW45,\"\")","v":0},{"$f":"IFERROR(Scenarios!AX45,\"\")","v":0},{"$f":"IFERROR(Scenarios!AY45,\"\")","v":0},{"$f":"IFERROR(Scenarios!AZ45,\"\")","v":0},{"$f":"IFERROR(Scenarios!BA45,\"\")","v":0},{"$f":"IFERROR(Scenarios!BB45,\"\")","v":0},{"$f":"IFERROR(Scenarios!BC45,\"\")","v":0},{"$f":"IFERROR(Scenarios!BD45,\"\")","v":0},{"$f":"IFERROR(Scenarios!BE45,\"\")","v":0},{"$f":"IFERROR(Scenarios!BF45,\"\")","v":0},{"$f":"IFERROR(Scenarios!BG45,\"\")","v":0},{"$f":"IFERROR(Scenarios!BH45,\"\")","v":0},{"$f":"IFERROR(Scenarios!BI45,\"\")","v":0},{"$f":"IFERROR(Scenarios!BJ45,\"\")","v":0},{"$f":"IFERROR(Scenarios!BK45,\"\")","v":0},{"$f":"IFERROR(Scenarios!BL45,\"\")","v":0},{"$f":"IFERROR(Scenarios!BM45,\"\")","v":0},{"$f":"IFERROR(Scenarios!BN45,\"\")","v":0},{"$f":"IFERROR(Scenarios!BO45,\"\")","v":0},{"$f":"IFERROR(Scenarios!BP45,\"\")","v":0},{"$f":"IFERROR(Scenarios!BQ45,\"\")","v":0},{"$f":"IFERROR(Scenarios!BR45,\"\")","v":0},{"$f":"IFERROR(Scenarios!BS45,\"\")","v":0},{"$f":"IFERROR(Scenarios!BT45,\"\")","v":0},{"$f":"IFERROR(Scenarios!BU45,\"\")","v":0},{"$f":"IFERROR(Scenarios!BV45,\"\")","v":0},{"$f":"IFERROR(Scenarios!BW45,\"\")","v":0},{"$f":"IFERROR(Scenarios!BX45,\"\")","v":0},{"$f":"IFERROR(Scenarios!BY45,\"\")","v":0},{"$f":"IFERROR(Scenarios!BZ45,\"\")","v":0},{"$f":"IFERROR(Scenarios!CA45,\"\")","v":0},{"$f":"IFERROR(Scenarios!CB45,\"\")","v":0},{"$f":"IFERROR(Scenarios!CC45,\"\")","v":0},{"$f":"IFERROR(Scenarios!CD45,\"\")","v":0},{"$f":"IFERROR(Scenarios!CE45,\"\")","v":0},{"$f":"IFERROR(Scenarios!CF45,\"\")","v":0},{"$f":"IFERROR(Scenarios!CG45,\"\")","v":0},{"$f":"IFERROR(Scenarios!CH45,\"\")","v":0},{"$f":"IFERROR(Scenarios!CI45,\"\")","v":0},{"$f":"IFERROR(Scenarios!CJ45,\"\")","v":0},{"$f":"IFERROR(Scenarios!CK45,\"\")","v":0},{"$f":"IFERROR(Scenarios!CL45,\"\")","v":0},{"$f":"IFERROR(Scenarios!CM45,\"\")","v":0},{"$f":"IFERROR(Scenarios!CN45,\"\")","v":0},{"$f":"IFERROR(Scenarios!CO45,\"\")","v":0},{"$f":"IFERROR(Scenarios!CP45,\"\")","v":0},{"$f":"IFERROR(Scenarios!CQ45,\"\")","v":0},{"$f":"IFERROR(Scenarios!CR45,\"\")","v":0},{"$f":"IFERROR(Scenarios!CS45,\"\")","v":0},{"$f":"IFERROR(Scenarios!CT45,\"\")","v":0},{"$f":"IFERROR(Scenarios!CU45,\"\")","v":0},{"$f":"IFERROR(Scenarios!CV45,\"\")","v":0},{"$f":"IFERROR(Scenarios!CW45,\"\")","v":0},{"$f":"IFERROR(Scenarios!CX45,\"\")","v":0},{"$f":"IFERROR(Scenarios!CY45,\"\")","v":0},{"$f":"IFERROR(Scenarios!CZ45,\"\")","v":0},{"$f":"IFERROR(Scenarios!DA45,\"\")","v":0}]
[{"$f":"IFERROR(Scenarios!A46,\"\")","v":0},{"$f":"IFERROR(Scenarios!B46,\"\")","v":0},{"$f":"IFERROR(Scenarios!C46,\"\")","v":0},{"$f":"IFERROR(Scenarios!D46,\"\")","v":0},{"$f":"IFERROR(Scenarios!E46,\"\")","v":0},{"$f":"IFERROR(Scenarios!F46,\"\")","v":0},{"$f":"IFERROR(Scenarios!G46,\"\")","v":0},{"$f":"IFERROR(Scenarios!H46,\"\")","v":0},{"$f":"IFERROR(Scenarios!I46,\"\")","v":0},{"$f":"IFERROR(Scenarios!J46,\"\")","v":0},{"$f":"IFERROR(Scenarios!K46,\"\")","v":0},{"$f":"IFERROR(Scenarios!L46,\"\")","v":0},{"$f":"IFERROR(Scenarios!M46,\"\")","v":0},{"$f":"IFERROR(Scenarios!N46,\"\")","v":0},{"$f":"IFERROR(Scenarios!O46,\"\")","v":0},{"$f":"IFERROR(Scenarios!P46,\"\")","v":0},{"$f":"IFERROR(Scenarios!Q46,\"\")","v":0},{"$f":"IFERROR(Scenarios!R46,\"\")","v":0},{"$f":"IFERROR(Scenarios!S46,\"\")","v":0},{"$f":"IFERROR(Scenarios!T46,\"\")","v":0},{"$f":"IFERROR(Scenarios!U46,\"\")","v":0},{"$f":"IFERROR(Scenarios!V46,\"\")","v":0},{"$f":"IFERROR(Scenarios!W46,\"\")","v":0},{"$f":"IFERROR(Scenarios!X46,\"\")","v":0},{"$f":"IFERROR(Scenarios!Y46,\"\")","v":0},{"$f":"IFERROR(Scenarios!Z46,\"\")","v":0},{"$f":"IFERROR(Scenarios!AA46,\"\")","v":0},{"$f":"IFERROR(Scenarios!AB46,\"\")","v":0},{"$f":"IFERROR(Scenarios!AC46,\"\")","v":0},{"$f":"IFERROR(Scenarios!AD46,\"\")","v":0},{"$f":"IFERROR(Scenarios!AE46,\"\")","v":0},{"$f":"IFERROR(Scenarios!AF46,\"\")","v":0},{"$f":"IFERROR(Scenarios!AG46,\"\")","v":0},{"$f":"IFERROR(Scenarios!AH46,\"\")","v":0},{"$f":"IFERROR(Scenarios!AI46,\"\")","v":0},{"$f":"IFERROR(Scenarios!AJ46,\"\")","v":0},{"$f":"IFERROR(Scenarios!AK46,\"\")","v":0},{"$f":"IFERROR(Scenarios!AL46,\"\")","v":0},{"$f":"IFERROR(Scenarios!AM46,\"\")","v":0},{"$f":"IFERROR(Scenarios!AN46,\"\")","v":0},{"$f":"IFERROR(Scenarios!AO46,\"\")","v":0},{"$f":"IFERROR(Scenarios!AP46,\"\")","v":0},{"$f":"IFERROR(Scenarios!AQ46,\"\")","v":0},{"$f":"IFERROR(Scenarios!AR46,\"\")","v":0},{"$f":"IFERROR(Scenarios!AS46,\"\")","v":0},{"$f":"IFERROR(Scenarios!AT46,\"\")","v":0},{"$f":"IFERROR(Scenarios!AU46,\"\")","v":0},{"$f":"IFERROR(Scenarios!AV46,\"\")","v":0},{"$f":"IFERROR(Scenarios!AW46,\"\")","v":0},{"$f":"IFERROR(Scenarios!AX46,\"\")","v":0},{"$f":"IFERROR(Scenarios!AY46,\"\")","v":0},{"$f":"IFERROR(Scenarios!AZ46,\"\")","v":0},{"$f":"IFERROR(Scenarios!BA46,\"\")","v":0},{"$f":"IFERROR(Scenarios!BB46,\"\")","v":0},{"$f":"IFERROR(Scenarios!BC46,\"\")","v":0},{"$f":"IFERROR(Scenarios!BD46,\"\")","v":0},{"$f":"IFERROR(Scenarios!BE46,\"\")","v":0},{"$f":"IFERROR(Scenarios!BF46,\"\")","v":0},{"$f":"IFERROR(Scenarios!BG46,\"\")","v":0},{"$f":"IFERROR(Scenarios!BH46,\"\")","v":0},{"$f":"IFERROR(Scenarios!BI46,\"\")","v":0},{"$f":"IFERROR(Scenarios!BJ46,\"\")","v":0},{"$f":"IFERROR(Scenarios!BK46,\"\")","v":0},{"$f":"IFERROR(Scenarios!BL46,\"\")","v":0},{"$f":"IFERROR(Scenarios!BM46,\"\")","v":0},{"$f":"IFERROR(Scenarios!BN46,\"\")","v":0},{"$f":"IFERROR(Scenarios!BO46,\"\")","v":0},{"$f":"IFERROR(Scenarios!BP46,\"\")","v":0},{"$f":"IFERROR(Scenarios!BQ46,\"\")","v":0},{"$f":"IFERROR(Scenarios!BR46,\"\")","v":0},{"$f":"IFERROR(Scenarios!BS46,\"\")","v":0},{"$f":"IFERROR(Scenarios!BT46,\"\")","v":0},{"$f":"IFERROR(Scenarios!BU46,\"\")","v":0},{"$f":"IFERROR(Scenarios!BV46,\"\")","v":0},{"$f":"IFERROR(Scenarios!BW46,\"\")","v":0},{"$f":"IFERROR(Scenarios!BX46,\"\")","v":0},{"$f":"IFERROR(Scenarios!BY46,\"\")","v":0},{"$f":"IFERROR(Scenarios!BZ46,\"\")","v":0},{"$f":"IFERROR(Scenarios!CA46,\"\")","v":0},{"$f":"IFERROR(Scenarios!CB46,\"\")","v":0},{"$f":"IFERROR(Scenarios!CC46,\"\")","v":0},{"$f":"IFERROR(Scenarios!CD46,\"\")","v":0},{"$f":"IFERROR(Scenarios!CE46,\"\")","v":0},{"$f":"IFERROR(Scenarios!CF46,\"\")","v":0},{"$f":"IFERROR(Scenarios!CG46,\"\")","v":0},{"$f":"IFERROR(Scenarios!CH46,\"\")","v":0},{"$f":"IFERROR(Scenarios!CI46,\"\")","v":0},{"$f":"IFERROR(Scenarios!CJ46,\"\")","v":0},{"$f":"IFERROR(Scenarios!CK46,\"\")","v":0},{"$f":"IFERROR(Scenarios!CL46,\"\")","v":0},{"$f":"IFERROR(Scenarios!CM46,\"\")","v":0},{"$f":"IFERROR(Scenarios!CN46,\"\")","v":0},{"$f":"IFERROR(Scenarios!CO46,\"\")","v":0},{"$f":"IFERROR(Scenarios!CP46,\"\")","v":0},{"$f":"IFERROR(Scenarios!CQ46,\"\")","v":0},{"$f":"IFERROR(Scenarios!CR46,\"\")","v":0},{"$f":"IFERROR(Scenarios!CS46,\"\")","v":0},{"$f":"IFERROR(Scenarios!CT46,\"\")","v":0},{"$f":"IFERROR(Scenarios!CU46,\"\")","v":0},{"$f":"IFERROR(Scenarios!CV46,\"\")","v":0},{"$f":"IFERROR(Scenarios!CW46,\"\")","v":0},{"$f":"IFERROR(Scenarios!CX46,\"\")","v":0},{"$f":"IFERROR(Scenarios!CY46,\"\")","v":0},{"$f":"IFERROR(Scenarios!CZ46,\"\")","v":0},{"$f":"IFERROR(Scenarios!DA46,\"\")","v":0}]
[{"$f":"IFERROR(Scenarios!A47,\"\")","v":0},{"$f":"IFERROR(Scenarios!B47,\"\")","v":0},{"$f":"IFERROR(Scenarios!C47,\"\")","v":0},{"$f":"IFERROR(Scenarios!D47,\"\")","v":0},{"$f":"IFERROR(Scenarios!E47,\"\")","v":0},{"$f":"IFERROR(Scenarios!F47,\"\")","v":0},{"$f":"IFERROR(Scenarios!G47,\"\")","v":0},{"$f":"IFERROR(Scenarios!H47,\"\")","v":0},{"$f":"IFERROR(Scenarios!I47,\"\")","v":0},{"$f":"IFERROR(Scenarios!J47,\"\")","v":0},{"$f":"IFERROR(Scenarios!K47,\"\")","v":0},{"$f":"IFERROR(Scenarios!L47,\"\")","v":0},{"$f":"IFERROR(Scenarios!M47,\"\")","v":0},{"$f":"IFERROR(Scenarios!N47,\"\")","v":0},{"$f":"IFERROR(Scenarios!O47,\"\")","v":0},{"$f":"IFERROR(Scenarios!P47,\"\")","v":0},{"$f":"IFERROR(Scenarios!Q47,\"\")","v":0},{"$f":"IFERROR(Scenarios!R47,\"\")","v":0},{"$f":"IFERROR(Scenarios!S47,\"\")","v":0},{"$f":"IFERROR(Scenarios!T47,\"\")","v":0},{"$f":"IFERROR(Scenarios!U47,\"\")","v":0},{"$f":"IFERROR(Scenarios!V47,\"\")","v":0},{"$f":"IFERROR(Scenarios!W47,\"\")","v":0},{"$f":"IFERROR(Scenarios!X47,\"\")","v":0},{"$f":"IFERROR(Scenarios!Y47,\"\")","v":0},{"$f":"IFERROR(Scenarios!Z47,\"\")","v":0},{"$f":"IFERROR(Scenarios!AA47,\"\")","v":0},{"$f":"IFERROR(Scenarios!AB47,\"\")","v":0},{"$f":"IFERROR(Scenarios!AC47,\"\")","v":0},{"$f":"IFERROR(Scenarios!AD47,\"\")","v":0},{"$f":"IFERROR(Scenarios!AE47,\"\")","v":0},{"$f":"IFERROR(Scenarios!AF47,\"\")","v":0},{"$f":"IFERROR(Scenarios!AG47,\"\")","v":0},{"$f":"IFERROR(Scenarios!AH47,\"\")","v":0},{"$f":"IFERROR(Scenarios!AI47,\"\")","v":0},{"$f":"IFERROR(Scenarios!AJ47,\"\")","v":0},{"$f":"IFERROR(Scenarios!AK47,\"\")","v":0},{"$f":"IFERROR(Scenarios!AL47,\"\")","v":0},{"$f":"IFERROR(Scenarios!AM47,\"\")","v":0},{"$f":"IFERROR(Scenarios!AN47,\"\")","v":0},{"$f":"IFERROR(Scenarios!AO47,\"\")","v":0},{"$f":"IFERROR(Scenarios!AP47,\"\")","v":0},{"$f":"IFERROR(Scenarios!AQ47,\"\")","v":0},{"$f":"IFERROR(Scenarios!AR47,\"\")","v":0},{"$f":"IFERROR(Scenarios!AS47,\"\")","v":0},{"$f":"IFERROR(Scenarios!AT47,\"\")","v":0},{"$f":"IFERROR(Scenarios!AU47,\"\")","v":0},{"$f":"IFERROR(Scenarios!AV47,\"\")","v":0},{"$f":"IFERROR(Scenarios!AW47,\"\")","v":0},{"$f":"IFERROR(Scenarios!AX47,\"\")","v":0},{"$f":"IFERROR(Scenarios!AY47,\"\")","v":0},{"$f":"IFERROR(Scenarios!AZ47,\"\")","v":0},{"$f":"IFERROR(Scenarios!BA47,\"\")","v":0},{"$f":"IFERROR(Scenarios!BB47,\"\")","v":0},{"$f":"IFERROR(Scenarios!BC47,\"\")","v":0},{"$f":"IFERROR(Scenarios!BD47,\"\")","v":0},{"$f":"IFERROR(Scenarios!BE47,\"\")","v":0},{"$f":"IFERROR(Scenarios!BF47,\"\")","v":0},{"$f":"IFERROR(Scenarios!BG47,\"\")","v":0},{"$f":"IFERROR(Scenarios!BH47,\"\")","v":0},{"$f":"IFERROR(Scenarios!BI47,\"\")","v":0},{"$f":"IFERROR(Scenarios!BJ47,\"\")","v":0},{"$f":"IFERROR(Scenarios!BK47,\"\")","v":0},{"$f":"IFERROR(Scenarios!BL47,\"\")","v":0},{"$f":"IFERROR(Scenarios!BM47,\"\")","v":0},{"$f":"IFERROR(Scenarios!BN47,\"\")","v":0},{"$f":"IFERROR(Scenarios!BO47,\"\")","v":0},{"$f":"IFERROR(Scenarios!BP47,\"\")","v":0},{"$f":"IFERROR(Scenarios!BQ47,\"\")","v":0},{"$f":"IFERROR(Scenarios!BR47,\"\")","v":0},{"$f":"IFERROR(Scenarios!BS47,\"\")","v":0},{"$f":"IFERROR(Scenarios!BT47,\"\")","v":0},{"$f":"IFERROR(Scenarios!BU47,\"\")","v":0},{"$f":"IFERROR(Scenarios!BV47,\"\")","v":0},{"$f":"IFERROR(Scenarios!BW47,\"\")","v":0},{"$f":"IFERROR(Scenarios!BX47,\"\")","v":0},{"$f":"IFERROR(Scenarios!BY47,\"\")","v":0},{"$f":"IFERROR(Scenarios!BZ47,\"\")","v":0},{"$f":"IFERROR(Scenarios!CA47,\"\")","v":0},{"$f":"IFERROR(Scenarios!CB47,\"\")","v":0},{"$f":"IFERROR(Scenarios!CC47,\"\")","v":0},{"$f":"IFERROR(Scenarios!CD47,\"\")","v":0},{"$f":"IFERROR(Scenarios!CE47,\"\")","v":0},{"$f":"IFERROR(Scenarios!CF47,\"\")","v":0},{"$f":"IFERROR(Scenarios!CG47,\"\")","v":0},{"$f":"IFERROR(Scenarios!CH47,\"\")","v":0},{"$f":"IFERROR(Scenarios!CI47,\"\")","v":0},{"$f":"IFERROR(Scenarios!CJ47,\"\")","v":0},{"$f":"IFERROR(Scenarios!CK47,\"\")","v":0},{"$f":"IFERROR(Scenarios!CL47,\"\")","v":0},{"$f":"IFERROR(Scenarios!CM47,\"\")","v":0},{"$f":"IFERROR(Scenarios!CN47,\"\")","v":0},{"$f":"IFERROR(Scenarios!CO47,\"\")","v":0},{"$f":"IFERROR(Scenarios!CP47,\"\")","v":0},{"$f":"IFERROR(Scenarios!CQ47,\"\")","v":0},{"$f":"IFERROR(Scenarios!CR47,\"\")","v":0},{"$f":"IFERROR(Scenarios!CS47,\"\")","v":0},{"$f":"IFERROR(Scenarios!CT47,\"\")","v":0},{"$f":"IFERROR(Scenarios!CU47,\"\")","v":0},{"$f":"IFERROR(Scenarios!CV47,\"\")","v":0},{"$f":"IFERROR(Scenarios!CW47,\"\")","v":0},{"$f":"IFERROR(Scenarios!CX47,\"\")","v":0},{"$f":"IFERROR(Scenarios!CY47,\"\")","v":0},{"$f":"IFERROR(Scenarios!CZ47,\"\")","v":0},{"$f":"IFERROR(Scenarios!DA47,\"\")","v":0}]
[{"$f":"IFERROR(Scenarios!A48,\"\")","v":0},{"$f":"IFERROR(Scenarios!B48,\"\")","v":0},{"$f":"IFERROR(Scenarios!C48,\"\")","v":0},{"$f":"IFERROR(Scenarios!D48,\"\")","v":0},{"$f":"IFERROR(Scenarios!E48,\"\")","v":0},{"$f":"IFERROR(Scenarios!F48,\"\")","v":0},{"$f":"IFERROR(Scenarios!G48,\"\")","v":0},{"$f":"IFERROR(Scenarios!H48,\"\")","v":0},{"$f":"IFERROR(Scenarios!I48,\"\")","v":0},{"$f":"IFERROR(Scenarios!J48,\"\")","v":0},{"$f":"IFERROR(Scenarios!K48,\"\")","v":0},{"$f":"IFERROR(Scenarios!L48,\"\")","v":0},{"$f":"IFERROR(Scenarios!M48,\"\")","v":0},{"$f":"IFERROR(Scenarios!N48,\"\")","v":0},{"$f":"IFERROR(Scenarios!O48,\"\")","v":0},{"$f":"IFERROR(Scenarios!P48,\"\")","v":0},{"$f":"IFERROR(Scenarios!Q48,\"\")","v":0},{"$f":"IFERROR(Scenarios!R48,\"\")","v":0},{"$f":"IFERROR(Scenarios!S48,\"\")","v":0},{"$f":"IFERROR(Scenarios!T48,\"\")","v":0},{"$f":"IFERROR(Scenarios!U48,\"\")","v":0},{"$f":"IFERROR(Scenarios!V48,\"\")","v":0},{"$f":"IFERROR(Scenarios!W48,\"\")","v":0},{"$f":"IFERROR(Scenarios!X48,\"\")","v":0},{"$f":"IFERROR(Scenarios!Y48,\"\")","v":0},{"$f":"IFERROR(Scenarios!Z48,\"\")","v":0},{"$f":"IFERROR(Scenarios!AA48,\"\")","v":0},{"$f":"IFERROR(Scenarios!AB48,\"\")","v":0},{"$f":"IFERROR(Scenarios!AC48,\"\")","v":0},{"$f":"IFERROR(Scenarios!AD48,\"\")","v":0},{"$f":"IFERROR(Scenarios!AE48,\"\")","v":0},{"$f":"IFERROR(Scenarios!AF48,\"\")","v":0},{"$f":"IFERROR(Scenarios!AG48,\"\")","v":0},{"$f":"IFERROR(Scenarios!AH48,\"\")","v":0},{"$f":"IFERROR(Scenarios!AI48,\"\")","v":0},{"$f":"IFERROR(Scenarios!AJ48,\"\")","v":0},{"$f":"IFERROR(Scenarios!AK48,\"\")","v":0},{"$f":"IFERROR(Scenarios!AL48,\"\")","v":0},{"$f":"IFERROR(Scenarios!AM48,\"\")","v":0},{"$f":"IFERROR(Scenarios!AN48,\"\")","v":0},{"$f":"IFERROR(Scenarios!AO48,\"\")","v":0},{"$f":"IFERROR(Scenarios!AP48,\"\")","v":0},{"$f":"IFERROR(Scenarios!AQ48,\"\")","v":0},{"$f":"IFERROR(Scenarios!AR48,\"\")","v":0},{"$f":"IFERROR(Scenarios!AS48,\"\")","v":0},{"$f":"IFERROR(Scenarios!AT48,\"\")","v":0},{"$f":"IFERROR(Scenarios!AU48,\"\")","v":0},{"$f":"IFERROR(Scenarios!AV48,\"\")","v":0},{"$f":"IFERROR(Scenarios!AW48,\"\")","v":0},{"$f":"IFERROR(Scenarios!AX48,\"\")","v":0},{"$f":"IFERROR(Scenarios!AY48,\"\")","v":0},{"$f":"IFERROR(Scenarios!AZ48,\"\")","v":0},{"$f":"IFERROR(Scenarios!BA48,\"\")","v":0},{"$f":"IFERROR(Scenarios!BB48,\"\")","v":0},{"$f":"IFERROR(Scenarios!BC48,\"\")","v":0},{"$f":"IFERROR(Scenarios!BD48,\"\")","v":0},{"$f":"IFERROR(Scenarios!BE48,\"\")","v":0},{"$f":"IFERROR(Scenarios!BF48,\"\")","v":0},{"$f":"IFERROR(Scenarios!BG48,\"\")","v":0},{"$f":"IFERROR(Scenarios!BH48,\"\")","v":0},{"$f":"IFERROR(Scenarios!BI48,\"\")","v":0},{"$f":"IFERROR(Scenarios!BJ48,\"\")","v":0},{"$f":"IFERROR(Scenarios!BK48,\"\")","v":0},{"$f":"IFERROR(Scenarios!BL48,\"\")","v":0},{"$f":"IFERROR(Scenarios!BM48,\"\")","v":0},{"$f":"IFERROR(Scenarios!BN48,\"\")","v":0},{"$f":"IFERROR(Scenarios!BO48,\"\")","v":0},{"$f":"IFERROR(Scenarios!BP48,\"\")","v":0},{"$f":"IFERROR(Scenarios!BQ48,\"\")","v":0},{"$f":"IFERROR(Scenarios!BR48,\"\")","v":0},{"$f":"IFERROR(Scenarios!BS48,\"\")","v":0},{"$f":"IFERROR(Scenarios!BT48,\"\")","v":0},{"$f":"IFERROR(Scenarios!BU48,\"\")","v":0},{"$f":"IFERROR(Scenarios!BV48,\"\")","v":0},{"$f":"IFERROR(Scenarios!BW48,\"\")","v":0},{"$f":"IFERROR(Scenarios!BX48,\"\")","v":0},{"$f":"IFERROR(Scenarios!BY48,\"\")","v":0},{"$f":"IFERROR(Scenarios!BZ48,\"\")","v":0},{"$f":"IFERROR(Scenarios!CA48,\"\")","v":0},{"$f":"IFERROR(Scenarios!CB48,\"\")","v":0},{"$f":"IFERROR(Scenarios!CC48,\"\")","v":0},{"$f":"IFERROR(Scenarios!CD48,\"\")","v":0},{"$f":"IFERROR(Scenarios!CE48,\"\")","v":0},{"$f":"IFERROR(Scenarios!CF48,\"\")","v":0},{"$f":"IFERROR(Scenarios!CG48,\"\")","v":0},{"$f":"IFERROR(Scenarios!CH48,\"\")","v":0},{"$f":"IFERROR(Scenarios!CI48,\"\")","v":0},{"$f":"IFERROR(Scenarios!CJ48,\"\")","v":0},{"$f":"IFERROR(Scenarios!CK48,\"\")","v":0},{"$f":"IFERROR(Scenarios!CL48,\"\")","v":0},{"$f":"IFERROR(Scenarios!CM48,\"\")","v":0},{"$f":"IFERROR(Scenarios!CN48,\"\")","v":0},{"$f":"IFERROR(Scenarios!CO48,\"\")","v":0},{"$f":"IFERROR(Scenarios!CP48,\"\")","v":0},{"$f":"IFERROR(Scenarios!CQ48,\"\")","v":0},{"$f":"IFERROR(Scenarios!CR48,\"\")","v":0},{"$f":"IFERROR(Scenarios!CS48,\"\")","v":0},{"$f":"IFERROR(Scenarios!CT48,\"\")","v":0},{"$f":"IFERROR(Scenarios!CU48,\"\")","v":0},{"$f":"IFERROR(Scenarios!CV48,\"\")","v":0},{"$f":"IFERROR(Scenarios!CW48,\"\")","v":0},{"$f":"IFERROR(Scenarios!CX48,\"\")","v":0},{"$f":"IFERROR(Scenarios!CY48,\"\")","v":0},{"$f":"IFERROR(Scenarios!CZ48,\"\")","v":0},{"$f":"IFERROR(Scenarios!DA48,\"\")","v":0}]
[{"$f":"IFERROR(Scenarios!A49,\"\")","v":0},{"$f":"IFERROR(Scenarios!B49,\"\")","v":0},{"$f":"IFERROR(Scenarios!C49,\"\")","v":0},{"$f":"IFERROR(Scenarios!D49,\"\")","v":0},{"$f":"IFERROR(Scenarios!E49,\"\")","v":0},{"$f":"IFERROR(Scenarios!F49,\"\")","v":0},{"$f":"IFERROR(Scenarios!G49,\"\")","v":0},{"$f":"IFERROR(Scenarios!H49,\"\")","v":0},{"$f":"IFERROR(Scenarios!I49,\"\")","v":0},{"$f":"IFERROR(Scenarios!J49,\"\")","v":0},{"$f":"IFERROR(Scenarios!K49,\"\")","v":0},{"$f":"IFERROR(Scenarios!L49,\"\")","v":0},{"$f":"IFERROR(Scenarios!M49,\"\")","v":0},{"$f":"IFERROR(Scenarios!N49,\"\")","v":0},{"$f":"IFERROR(Scenarios!O49,\"\")","v":0},{"$f":"IFERROR(Scenarios!P49,\"\")","v":0},{"$f":"IFERROR(Scenarios!Q49,\"\")","v":0},{"$f":"IFERROR(Scenarios!R49,\"\")","v":0},{"$f":"IFERROR(Scenarios!S49,\"\")","v":0},{"$f":"IFERROR(Scenarios!T49,\"\")","v":0},{"$f":"IFERROR(Scenarios!U49,\"\")","v":0},{"$f":"IFERROR(Scenarios!V49,\"\")","v":0},{"$f":"IFERROR(Scenarios!W49,\"\")","v":0},{"$f":"IFERROR(Scenarios!X49,\"\")","v":0},{"$f":"IFERROR(Scenarios!Y49,\"\")","v":0},{"$f":"IFERROR(Scenarios!Z49,\"\")","v":0},{"$f":"IFERROR(Scenarios!AA49,\"\")","v":0},{"$f":"IFERROR(Scenarios!AB49,\"\")","v":0},{"$f":"IFERROR(Scenarios!AC49,\"\")","v":0},{"$f":"IFERROR(Scenarios!AD49,\"\")","v":0},{"$f":"IFERROR(Scenarios!AE49,\"\")","v":0},{"$f":"IFERROR(Scenarios!AF49,\"\")","v":0},{"$f":"IFERROR(Scenarios!AG49,\"\")","v":0},{"$f":"IFERROR(Scenarios!AH49,\"\")","v":0},{"$f":"IFERROR(Scenarios!AI49,\"\")","v":0},{"$f":"IFERROR(Scenarios!AJ49,\"\")","v":0},{"$f":"IFERROR(Scenarios!AK49,\"\")","v":0},{"$f":"IFERROR(Scenarios!AL49,\"\")","v":0},{"$f":"IFERROR(Scenarios!AM49,\"\")","v":0},{"$f":"IFERROR(Scenarios!AN49,\"\")","v":0},{"$f":"IFERROR(Scenarios!AO49,\"\")","v":0},{"$f":"IFERROR(Scenarios!AP49,\"\")","v":0},{"$f":"IFERROR(Scenarios!AQ49,\"\")","v":0},{"$f":"IFERROR(Scenarios!AR49,\"\")","v":0},{"$f":"IFERROR(Scenarios!AS49,\"\")","v":0},{"$f":"IFERROR(Scenarios!AT49,\"\")","v":0},{"$f":"IFERROR(Scenarios!AU49,\"\")","v":0},{"$f":"IFERROR(Scenarios!AV49,\"\")","v":0},{"$f":"IFERROR(Scenarios!AW49,\"\")","v":0},{"$f":"IFERROR(Scenarios!AX49,\"\")","v":0},{"$f":"IFERROR(Scenarios!AY49,\"\")","v":0},{"$f":"IFERROR(Scenarios!AZ49,\"\")","v":0},{"$f":"IFERROR(Scenarios!BA49,\"\")","v":0},{"$f":"IFERROR(Scenarios!BB49,\"\")","v":0},{"$f":"IFERROR(Scenarios!BC49,\"\")","v":0},{"$f":"IFERROR(Scenarios!BD49,\"\")","v":0},{"$f":"IFERROR(Scenarios!BE49,\"\")","v":0},{"$f":"IFERROR(Scenarios!BF49,\"\")","v":0},{"$f":"IFERROR(Scenarios!BG49,\"\")","v":0},{"$f":"IFERROR(Scenarios!BH49,\"\")","v":0},{"$f":"IFERROR(Scenarios!BI49,\"\")","v":0},{"$f":"IFERROR(Scenarios!BJ49,\"\")","v":0},{"$f":"IFERROR(Scenarios!BK49,\"\")","v":0},{"$f":"IFERROR(Scenarios!BL49,\"\")","v":0},{"$f":"IFERROR(Scenarios!BM49,\"\")","v":0},{"$f":"IFERROR(Scenarios!BN49,\"\")","v":0},{"$f":"IFERROR(Scenarios!BO49,\"\")","v":0},{"$f":"IFERROR(Scenarios!BP49,\"\")","v":0},{"$f":"IFERROR(Scenarios!BQ49,\"\")","v":0},{"$f":"IFERROR(Scenarios!BR49,\"\")","v":0},{"$f":"IFERROR(Scenarios!BS49,\"\")","v":0},{"$f":"IFERROR(Scenarios!BT49,\"\")","v":0},{"$f":"IFERROR(Scenarios!BU49,\"\")","v":0},{"$f":"IFERROR(Scenarios!BV49,\"\")","v":0},{"$f":"IFERROR(Scenarios!BW49,\"\")","v":0},{"$f":"IFERROR(Scenarios!BX49,\"\")","v":0},{"$f":"IFERROR(Scenarios!BY49,\"\")","v":0},{"$f":"IFERROR(Scenarios!BZ49,\"\")","v":0},{"$f":"IFERROR(Scenarios!CA49,\"\")","v":0},{"$f":"IFERROR(Scenarios!CB49,\"\")","v":0},{"$f":"IFERROR(Scenarios!CC49,\"\")","v":0},{"$f":"IFERROR(Scenarios!CD49,\"\")","v":0},{"$f":"IFERROR(Scenarios!CE49,\"\")","v":0},{"$f":"IFERROR(Scenarios!CF49,\"\")","v":0},{"$f":"IFERROR(Scenarios!CG49,\"\")","v":0},{"$f":"IFERROR(Scenarios!CH49,\"\")","v":0},{"$f":"IFERROR(Scenarios!CI49,\"\")","v":0},{"$f":"IFERROR(Scenarios!CJ49,\"\")","v":0},{"$f":"IFERROR(Scenarios!CK49,\"\")","v":0},{"$f":"IFERROR(Scenarios!CL49,\"\")","v":0},{"$f":"IFERROR(Scenarios!CM49,\"\")","v":0},{"$f":"IFERROR(Scenarios!CN49,\"\")","v":0},{"$f":"IFERROR(Scenarios!CO49,\"\")","v":0},{"$f":"IFERROR(Scenarios!CP49,\"\")","v":0},{"$f":"IFERROR(Scenarios!CQ49,\"\")","v":0},{"$f":"IFERROR(Scenarios!CR49,\"\")","v":0},{"$f":"IFERROR(Scenarios!CS49,\"\")","v":0},{"$f":"IFERROR(Scenarios!CT49,\"\")","v":0},{"$f":"IFERROR(Scenarios!CU49,\"\")","v":0},{"$f":"IFERROR(Scenarios!CV49,\"\")","v":0},{"$f":"IFERROR(Scenarios!CW49,\"\")","v":0},{"$f":"IFERROR(Scenarios!CX49,\"\")","v":0},{"$f":"IFERROR(Scenarios!CY49,\"\")","v":0},{"$f":"IFERROR(Scenarios!CZ49,\"\")","v":0},{"$f":"IFERROR(Scenarios!DA49,\"\")","v":0}]
[{"$f":"IFERROR(Scenarios!A50,\"\")","v":0},{"$f":"IFERROR(Scenarios!B50,\"\")","v":0},{"$f":"IFERROR(Scenarios!C50,\"\")","v":0},{"$f":"IFERROR(Scenarios!D50,\"\")","v":0},{"$f":"IFERROR(Scenarios!E50,\"\")","v":0},{"$f":"IFERROR(Scenarios!F50,\"\")","v":0},{"$f":"IFERROR(Scenarios!G50,\"\")","v":0},{"$f":"IFERROR(Scenarios!H50,\"\")","v":0},{"$f":"IFERROR(Scenarios!I50,\"\")","v":0},{"$f":"IFERROR(Scenarios!J50,\"\")","v":0},{"$f":"IFERROR(Scenarios!K50,\"\")","v":0},{"$f":"IFERROR(Scenarios!L50,\"\")","v":0},{"$f":"IFERROR(Scenarios!M50,\"\")","v":0},{"$f":"IFERROR(Scenarios!N50,\"\")","v":0},{"$f":"IFERROR(Scenarios!O50,\"\")","v":0},{"$f":"IFERROR(Scenarios!P50,\"\")","v":0},{"$f":"IFERROR(Scenarios!Q50,\"\")","v":0},{"$f":"IFERROR(Scenarios!R50,\"\")","v":0},{"$f":"IFERROR(Scenarios!S50,\"\")","v":0},{"$f":"IFERROR(Scenarios!T50,\"\")","v":0},{"$f":"IFERROR(Scenarios!U50,\"\")","v":0},{"$f":"IFERROR(Scenarios!V50,\"\")","v":0},{"$f":"IFERROR(Scenarios!W50,\"\")","v":0},{"$f":"IFERROR(Scenarios!X50,\"\")","v":0},{"$f":"IFERROR(Scenarios!Y50,\"\")","v":0},{"$f":"IFERROR(Scenarios!Z50,\"\")","v":0},{"$f":"IFERROR(Scenarios!AA50,\"\")","v":0},{"$f":"IFERROR(Scenarios!AB50,\"\")","v":0},{"$f":"IFERROR(Scenarios!AC50,\"\")","v":0},{"$f":"IFERROR(Scenarios!AD50,\"\")","v":0},{"$f":"IFERROR(Scenarios!AE50,\"\")","v":0},{"$f":"IFERROR(Scenarios!AF50,\"\")","v":0},{"$f":"IFERROR(Scenarios!AG50,\"\")","v":0},{"$f":"IFERROR(Scenarios!AH50,\"\")","v":0},{"$f":"IFERROR(Scenarios!AI50,\"\")","v":0},{"$f":"IFERROR(Scenarios!AJ50,\"\")","v":0},{"$f":"IFERROR(Scenarios!AK50,\"\")","v":0},{"$f":"IFERROR(Scenarios!AL50,\"\")","v":0},{"$f":"IFERROR(Scenarios!AM50,\"\")","v":0},{"$f":"IFERROR(Scenarios!AN50,\"\")","v":0},{"$f":"IFERROR(Scenarios!AO50,\"\")","v":0},{"$f":"IFERROR(Scenarios!AP50,\"\")","v":0},{"$f":"IFERROR(Scenarios!AQ50,\"\")","v":0},{"$f":"IFERROR(Scenarios!AR50,\"\")","v":0},{"$f":"IFERROR(Scenarios!AS50,\"\")","v":0},{"$f":"IFERROR(Scenarios!AT50,\"\")","v":0},{"$f":"IFERROR(Scenarios!AU50,\"\")","v":0},{"$f":"IFERROR(Scenarios!AV50,\"\")","v":0},{"$f":"IFERROR(Scenarios!AW50,\"\")","v":0},{"$f":"IFERROR(Scenarios!AX50,\"\")","v":0},{"$f":"IFERROR(Scenarios!AY50,\"\")","v":0},{"$f":"IFERROR(Scenarios!AZ50,\"\")","v":0},{"$f":"IFERROR(Scenarios!BA50,\"\")","v":0},{"$f":"IFERROR(Scenarios!BB50,\"\")","v":0},{"$f":"IFERROR(Scenarios!BC50,\"\")","v":0},{"$f":"IFERROR(Scenarios!BD50,\"\")","v":0},{"$f":"IFERROR(Scenarios!BE50,\"\")","v":0},{"$f":"IFERROR(Scenarios!BF50,\"\")","v":0},{"$f":"IFERROR(Scenarios!BG50,\"\")","v":0},{"$f":"IFERROR(Scenarios!BH50,\"\")","v":0},{"$f":"IFERROR(Scenarios!BI50,\"\")","v":0},{"$f":"IFERROR(Scenarios!BJ50,\"\")","v":0},{"$f":"IFERROR(Scenarios!BK50,\"\")","v":0},{"$f":"IFERROR(Scenarios!BL50,\"\")","v":0},{"$f":"IFERROR(Scenarios!BM50,\"\")","v":0},{"$f":"IFERROR(Scenarios!BN50,\"\")","v":0},{"$f":"IFERROR(Scenarios!BO50,\"\")","v":0},{"$f":"IFERROR(Scenarios!BP50,\"\")","v":0},{"$f":"IFERROR(Scenarios!BQ50,\"\")","v":0},{"$f":"IFERROR(Scenarios!BR50,\"\")","v":0},{"$f":"IFERROR(Scenarios!BS50,\"\")","v":0},{"$f":"IFERROR(Scenarios!BT50,\"\")","v":0},{"$f":"IFERROR(Scenarios!BU50,\"\")","v":0},{"$f":"IFERROR(Scenarios!BV50,\"\")","v":0},{"$f":"IFERROR(Scenarios!BW50,\"\")","v":0},{"$f":"IFERROR(Scenarios!BX50,\"\")","v":0},{"$f":"IFERROR(Scenarios!BY50,\"\")","v":0},{"$f":"IFERROR(Scenarios!BZ50,\"\")","v":0},{"$f":"IFERROR(Scenarios!CA50,\"\")","v":0},{"$f":"IFERROR(Scenarios!CB50,\"\")","v":0},{"$f":"IFERROR(Scenarios!CC50,\"\")","v":0},{"$f":"IFERROR(Scenarios!CD50,\"\")","v":0},{"$f":"IFERROR(Scenarios!CE50,\"\")","v":0},{"$f":"IFERROR(Scenarios!CF50,\"\")","v":0},{"$f":"IFERROR(Scenarios!CG50,\"\")","v":0},{"$f":"IFERROR(Scenarios!CH50,\"\")","v":0},{"$f":"IFERROR(Scenarios!CI50,\"\")","v":0},{"$f":"IFERROR(Scenarios!CJ50,\"\")","v":0},{"$f":"IFERROR(Scenarios!CK50,\"\")","v":0},{"$f":"IFERROR(Scenarios!CL50,\"\")","v":0},{"$f":"IFERROR(Scenarios!CM50,\"\")","v":0},{"$f":"IFERROR(Scenarios!CN50,\"\")","v":0},{"$f":"IFERROR(Scenarios!CO50,\"\")","v":0},{"$f":"IFERROR(Scenarios!CP50,\"\")","v":0},{"$f":"IFERROR(Scenarios!CQ50,\"\")","v":0},{"$f":"IFERROR(Scenarios!CR50,\"\")","v":0},{"$f":"IFERROR(Scenarios!CS50,\"\")","v":0},{"$f":"IFERROR(Scenarios!CT50,\"\")","v":0},{"$f":"IFERROR(Scenarios!CU50,\"\")","v":0},{"$f":"IFERROR(Scenarios!CV50,\"\")","v":0},{"$f":"IFERROR(Scenarios!CW50,\"\")","v":0},{"$f":"IFERROR(Scenarios!CX50,\"\")","v":0},{"$f":"IFERROR(Scenarios!CY50,\"\")","v":0},{"$f":"IFERROR(Scenarios!CZ50,\"\")","v":0},{"$f":"IFERROR(Scenarios!DA50,\"\")","v":0}]
[{"$f":"IFERROR(Scenarios!A51,\"\")","v":0},{"$f":"IFERROR(Scenarios!B51,\"\")","v":0},{"$f":"IFERROR(Scenarios!C51,\"\")","v":0},{"$f":"IFERROR(Scenarios!D51,\"\")","v":0},{"$f":"IFERROR(Scenarios!E51,\"\")","v":0},{"$f":"IFERROR(Scenarios!F51,\"\")","v":0},{"$f":"IFERROR(Scenarios!G51,\"\")","v":0},{"$f":"IFERROR(Scenarios!H51,\"\")","v":0},{"$f":"IFERROR(Scenarios!I51,\"\")","v":0},{"$f":"IFERROR(Scenarios!J51,\"\")","v":0},{"$f":"IFERROR(Scenarios!K51,\"\")","v":0},{"$f":"IFERROR(Scenarios!L51,\"\")","v":0},{"$f":"IFERROR(Scenarios!M51,\"\")","v":0},{"$f":"IFERROR(Scenarios!N51,\"\")","v":0},{"$f":"IFERROR(Scenarios!O51,\"\")","v":0},{"$f":"IFERROR(Scenarios!P51,\"\")","v":0},{"$f":"IFERROR(Scenarios!Q51,\"\")","v":0},{"$f":"IFERROR(Scenarios!R51,\"\")","v":0},{"$f":"IFERROR(Scenarios!S51,\"\")","v":0},{"$f":"IFERROR(Scenarios!T51,\"\")","v":0},{"$f":"IFERROR(Scenarios!U51,\"\")","v":0},{"$f":"IFERROR(Scenarios!V51,\"\")","v":0},{"$f":"IFERROR(Scenarios!W51,\"\")","v":0},{"$f":"IFERROR(Scenarios!X51,\"\")","v":0},{"$f":"IFERROR(Scenarios!Y51,\"\")","v":0},{"$f":"IFERROR(Scenarios!Z51,\"\")","v":0},{"$f":"IFERROR(Scenarios!AA51,\"\")","v":0},{"$f":"IFERROR(Scenarios!AB51,\"\")","v":0},{"$f":"IFERROR(Scenarios!AC51,\"\")","v":0},{"$f":"IFERROR(Scenarios!AD51,\"\")","v":0},{"$f":"IFERROR(Scenarios!AE51,\"\")","v":0},{"$f":"IFERROR(Scenarios!AF51,\"\")","v":0},{"$f":"IFERROR(Scenarios!AG51,\"\")","v":0},{"$f":"IFERROR(Scenarios!AH51,\"\")","v":0},{"$f":"IFERROR(Scenarios!AI51,\"\")","v":0},{"$f":"IFERROR(Scenarios!AJ51,\"\")","v":0},{"$f":"IFERROR(Scenarios!AK51,\"\")","v":0},{"$f":"IFERROR(Scenarios!AL51,\"\")","v":0},{"$f":"IFERROR(Scenarios!AM51,\"\")","v":0},{"$f":"IFERROR(Scenarios!AN51,\"\")","v":0},{"$f":"IFERROR(Scenarios!AO51,\"\")","v":0},{"$f":"IFERROR(Scenarios!AP51,\"\")","v":0},{"$f":"IFERROR(Scenarios!AQ51,\"\")","v":0},{"$f":"IFERROR(Scenarios!AR51,\"\")","v":0},{"$f":"IFERROR(Scenarios!AS51,\"\")","v":0},{"$f":"IFERROR(Scenarios!AT51,\"\")","v":0},{"$f":"IFERROR(Scenarios!AU51,\"\")","v":0},{"$f":"IFERROR(Scenarios!AV51,\"\")","v":0},{"$f":"IFERROR(Scenarios!AW51,\"\")","v":0},{"$f":"IFERROR(Scenarios!AX51,\"\")","v":0},{"$f":"IFERROR(Scenarios!AY51,\"\")","v":0},{"$f":"IFERROR(Scenarios!AZ51,\"\")","v":0},{"$f":"IFERROR(Scenarios!BA51,\"\")","v":0},{"$f":"IFERROR(Scenarios!BB51,\"\")","v":0},{"$f":"IFERROR(Scenarios!BC51,\"\")","v":0},{"$f":"IFERROR(Scenarios!BD51,\"\")","v":0},{"$f":"IFERROR(Scenarios!BE51,\"\")","v":0},{"$f":"IFERROR(Scenarios!BF51,\"\")","v":0},{"$f":"IFERROR(Scenarios!BG51,\"\")","v":0},{"$f":"IFERROR(Scenarios!BH51,\"\")","v":0},{"$f":"IFERROR(Scenarios!BI51,\"\")","v":0},{"$f":"IFERROR(Scenarios!BJ51,\"\")","v":0},{"$f":"IFERROR(Scenarios!BK51,\"\")","v":0},{"$f":"IFERROR(Scenarios!BL51,\"\")","v":0},{"$f":"IFERROR(Scenarios!BM51,\"\")","v":0},{"$f":"IFERROR(Scenarios!BN51,\"\")","v":0},{"$f":"IFERROR(Scenarios!BO51,\"\")","v":0},{"$f":"IFERROR(Scenarios!BP51,\"\")","v":0},{"$f":"IFERROR(Scenarios!BQ51,\"\")","v":0},{"$f":"IFERROR(Scenarios!BR51,\"\")","v":0},{"$f":"IFERROR(Scenarios!BS51,\"\")","v":0},{"$f":"IFERROR(Scenarios!BT51,\"\")","v":0},{"$f":"IFERROR(Scenarios!BU51,\"\")","v":0},{"$f":"IFERROR(Scenarios!BV51,\"\")","v":0},{"$f":"IFERROR(Scenarios!BW51,\"\")","v":0},{"$f":"IFERROR(Scenarios!BX51,\"\")","v":0},{"$f":"IFERROR(Scenarios!BY51,\"\")","v":0},{"$f":"IFERROR(Scenarios!BZ51,\"\")","v":0},{"$f":"IFERROR(Scenarios!CA51,\"\")","v":0},{"$f":"IFERROR(Scenarios!CB51,\"\")","v":0},{"$f":"IFERROR(Scenarios!CC51,\"\")","v":0},{"$f":"IFERROR(Scenarios!CD51,\"\")","v":0},{"$f":"IFERROR(Scenarios!CE51,\"\")","v":0},{"$f":"IFERROR(Scenarios!CF51,\"\")","v":0},{"$f":"IFERROR(Scenarios!CG51,\"\")","v":0},{"$f":"IFERROR(Scenarios!CH51,\"\")","v":0},{"$f":"IFERROR(Scenarios!CI51,\"\")","v":0},{"$f":"IFERROR(Scenarios!CJ51,\"\")","v":0},{"$f":"IFERROR(Scenarios!CK51,\"\")","v":0},{"$f":"IFERROR(Scenarios!CL51,\"\")","v":0},{"$f":"IFERROR(Scenarios!CM51,\"\")","v":0},{"$f":"IFERROR(Scenarios!CN51,\"\")","v":0},{"$f":"IFERROR(Scenarios!CO51,\"\")","v":0},{"$f":"IFERROR(Scenarios!CP51,\"\")","v":0},{"$f":"IFERROR(Scenarios!CQ51,\"\")","v":0},{"$f":"IFERROR(Scenarios!CR51,\"\")","v":0},{"$f":"IFERROR(Scenarios!CS51,\"\")","v":0},{"$f":"IFERROR(Scenarios!CT51,\"\")","v":0},{"$f":"IFERROR(Scenarios!CU51,\"\")","v":0},{"$f":"IFERROR(Scenarios!CV51,\"\")","v":0},{"$f":"IFERROR(Scenarios!CW51,\"\")","v":0},{"$f":"IFERROR(Scenarios!CX51,\"\")","v":0},{"$f":"IFERROR(Scenarios!CY51,\"\")","v":0},{"$f":"IFERROR(Scenarios!CZ51,\"\")","v":0},{"$f":"IFERROR(Scenarios!DA51,\"\")","v":0}]
[{"$f":"IFERROR(Scenarios!A52,\"\")","v":0},{"$f":"IFERROR(Scenarios!B52,\"\")","v":0},{"$f":"IFERROR(Scenarios!C52,\"\")","v":0},{"$f":"IFERROR(Scenarios!D52,\"\")","v":0},{"$f":"IFERROR(Scenarios!E52,\"\")","v":0},{"$f":"IFERROR(Scenarios!F52,\"\")","v":0},{"$f":"IFERROR(Scenarios!G52,\"\")","v":0},{"$f":"IFERROR(Scenarios!H52,\"\")","v":0},{"$f":"IFERROR(Scenarios!I52,\"\")","v":0},{"$f":"IFERROR(Scenarios!J52,\"\")","v":0},{"$f":"IFERROR(Scenarios!K52,\"\")","v":0},{"$f":"IFERROR(Scenarios!L52,\"\")","v":0},{"$f":"IFERROR(Scenarios!M52,\"\")","v":0},{"$f":"IFERROR(Scenarios!N52,\"\")","v":0},{"$f":"IFERROR(Scenarios!O52,\"\")","v":0},{"$f":"IFERROR(Scenarios!P52,\"\")","v":0},{"$f":"IFERROR(Scenarios!Q52,\"\")","v":0},{"$f":"IFERROR(Scenarios!R52,\"\")","v":0},{"$f":"IFERROR(Scenarios!S52,\"\")","v":0},{"$f":"IFERROR(Scenarios!T52,\"\")","v":0},{"$f":"IFERROR(Scenarios!U52,\"\")","v":0},{"$f":"IFERROR(Scenarios!V52,\"\")","v":0},{"$f":"IFERROR(Scenarios!W52,\"\")","v":0},{"$f":"IFERROR(Scenarios!X52,\"\")","v":0},{"$f":"IFERROR(Scenarios!Y52,\"\")","v":0},{"$f":"IFERROR(Scenarios!Z52,\"\")","v":0},{"$f":"IFERROR(Scenarios!AA52,\"\")","v":0},{"$f":"IFERROR(Scenarios!AB52,\"\")","v":0},{"$f":"IFERROR(Scenarios!AC52,\"\")","v":0},{"$f":"IFERROR(Scenarios!AD52,\"\")","v":0},{"$f":"IFERROR(Scenarios!AE52,\"\")","v":0},{"$f":"IFERROR(Scenarios!AF52,\"\")","v":0},{"$f":"IFERROR(Scenarios!AG52,\"\")","v":0},{"$f":"IFERROR(Scenarios!AH52,\"\")","v":0},{"$f":"IFERROR(Scenarios!AI52,\"\")","v":0},{"$f":"IFERROR(Scenarios!AJ52,\"\")","v":0},{"$f":"IFERROR(Scenarios!AK52,\"\")","v":0},{"$f":"IFERROR(Scenarios!AL52,\"\")","v":0},{"$f":"IFERROR(Scenarios!AM52,\"\")","v":0},{"$f":"IFERROR(Scenarios!AN52,\"\")","v":0},{"$f":"IFERROR(Scenarios!AO52,\"\")","v":0},{"$f":"IFERROR(Scenarios!AP52,\"\")","v":0},{"$f":"IFERROR(Scenarios!AQ52,\"\")","v":0},{"$f":"IFERROR(Scenarios!AR52,\"\")","v":0},{"$f":"IFERROR(Scenarios!AS52,\"\")","v":0},{"$f":"IFERROR(Scenarios!AT52,\"\")","v":0},{"$f":"IFERROR(Scenarios!AU52,\"\")","v":0},{"$f":"IFERROR(Scenarios!AV52,\"\")","v":0},{"$f":"IFERROR(Scenarios!AW52,\"\")","v":0},{"$f":"IFERROR(Scenarios!AX52,\"\")","v":0},{"$f":"IFERROR(Scenarios!AY52,\"\")","v":0},{"$f":"IFERROR(Scenarios!AZ52,\"\")","v":0},{"$f":"IFERROR(Scenarios!BA52,\"\")","v":0},{"$f":"IFERROR(Scenarios!BB52,\"\")","v":0},{"$f":"IFERROR(Scenarios!BC52,\"\")","v":0},{"$f":"IFERROR(Scenarios!BD52,\"\")","v":0},{"$f":"IFERROR(Scenarios!BE52,\"\")","v":0},{"$f":"IFERROR(Scenarios!BF52,\"\")","v":0},{"$f":"IFERROR(Scenarios!BG52,\"\")","v":0},{"$f":"IFERROR(Scenarios!BH52,\"\")","v":0},{"$f":"IFERROR(Scenarios!BI52,\"\")","v":0},{"$f":"IFERROR(Scenarios!BJ52,\"\")","v":0},{"$f":"IFERROR(Scenarios!BK52,\"\")","v":0},{"$f":"IFERROR(Scenarios!BL52,\"\")","v":0},{"$f":"IFERROR(Scenarios!BM52,\"\")","v":0},{"$f":"IFERROR(Scenarios!BN52,\"\")","v":0},{"$f":"IFERROR(Scenarios!BO52,\"\")","v":0},{"$f":"IFERROR(Scenarios!BP52,\"\")","v":0},{"$f":"IFERROR(Scenarios!BQ52,\"\")","v":0},{"$f":"IFERROR(Scenarios!BR52,\"\")","v":0},{"$f":"IFERROR(Scenarios!BS52,\"\")","v":0},{"$f":"IFERROR(Scenarios!BT52,\"\")","v":0},{"$f":"IFERROR(Scenarios!BU52,\"\")","v":0},{"$f":"IFERROR(Scenarios!BV52,\"\")","v":0},{"$f":"IFERROR(Scenarios!BW52,\"\")","v":0},{"$f":"IFERROR(Scenarios!BX52,\"\")","v":0},{"$f":"IFERROR(Scenarios!BY52,\"\")","v":0},{"$f":"IFERROR(Scenarios!BZ52,\"\")","v":0},{"$f":"IFERROR(Scenarios!CA52,\"\")","v":0},{"$f":"IFERROR(Scenarios!CB52,\"\")","v":0},{"$f":"IFERROR(Scenarios!CC52,\"\")","v":0},{"$f":"IFERROR(Scenarios!CD52,\"\")","v":0},{"$f":"IFERROR(Scenarios!CE52,\"\")","v":0},{"$f":"IFERROR(Scenarios!CF52,\"\")","v":0},{"$f":"IFERROR(Scenarios!CG52,\"\")","v":0},{"$f":"IFERROR(Scenarios!CH52,\"\")","v":0},{"$f":"IFERROR(Scenarios!CI52,\"\")","v":0},{"$f":"IFERROR(Scenarios!CJ52,\"\")","v":0},{"$f":"IFERROR(Scenarios!CK52,\"\")","v":0},{"$f":"IFERROR(Scenarios!CL52,\"\")","v":0},{"$f":"IFERROR(Scenarios!CM52,\"\")","v":0},{"$f":"IFERROR(Scenarios!CN52,\"\")","v":0},{"$f":"IFERROR(Scenarios!CO52,\"\")","v":0},{"$f":"IFERROR(Scenarios!CP52,\"\")","v":0},{"$f":"IFERROR(Scenarios!CQ52,\"\")","v":0},{"$f":"IFERROR(Scenarios!CR52,\"\")","v":0},{"$f":"IFERROR(Scenarios!CS52,\"\")","v":0},{"$f":"IFERROR(Scenarios!CT52,\"\")","v":0},{"$f":"IFERROR(Scenarios!CU52,\"\")","v":0},{"$f":"IFERROR(Scenarios!CV52,\"\")","v":0},{"$f":"IFERROR(Scenarios!CW52,\"\")","v":0},{"$f":"IFERROR(Scenarios!CX52,\"\")","v":0},{"$f":"IFERROR(Scenarios!CY52,\"\")","v":0},{"$f":"IFERROR(Scenarios!CZ52,\"\")","v":0},{"$f":"IFERROR(Scenarios!DA52,\"\")","v":0}]
[{"$f":"IFERROR(Scenarios!A53,\"\")","v":0},{"$f":"IFERROR(Scenarios!B53,\"\")","v":0},{"$f":"IFERROR(Scenarios!C53,\"\")","v":0},{"$f":"IFERROR(Scenarios!D53,\"\")","v":0},{"$f":"IFERROR(Scenarios!E53,\"\")","v":0},{"$f":"IFERROR(Scenarios!F53,\"\")","v":0},{"$f":"IFERROR(Scenarios!G53,\"\")","v":0},{"$f":"IFERROR(Scenarios!H53,\"\")","v":0},{"$f":"IFERROR(Scenarios!I53,\"\")","v":0},{"$f":"IFERROR(Scenarios!J53,\"\")","v":0},{"$f":"IFERROR(Scenarios!K53,\"\")","v":0},{"$f":"IFERROR(Scenarios!L53,\"\")","v":0},{"$f":"IFERROR(Scenarios!M53,\"\")","v":0},{"$f":"IFERROR(Scenarios!N53,\"\")","v":0},{"$f":"IFERROR(Scenarios!O53,\"\")","v":0},{"$f":"IFERROR(Scenarios!P53,\"\")","v":0},{"$f":"IFERROR(Scenarios!Q53,\"\")","v":0},{"$f":"IFERROR(Scenarios!R53,\"\")","v":0},{"$f":"IFERROR(Scenarios!S53,\"\")","v":0},{"$f":"IFERROR(Scenarios!T53,\"\")","v":0},{"$f":"IFERROR(Scenarios!U53,\"\")","v":0},{"$f":"IFERROR(Scenarios!V53,\"\")","v":0},{"$f":"IFERROR(Scenarios!W53,\"\")","v":0},{"$f":"IFERROR(Scenarios!X53,\"\")","v":0},{"$f":"IFERROR(Scenarios!Y53,\"\")","v":0},{"$f":"IFERROR(Scenarios!Z53,\"\")","v":0},{"$f":"IFERROR(Scenarios!AA53,\"\")","v":0},{"$f":"IFERROR(Scenarios!AB53,\"\")","v":0},{"$f":"IFERROR(Scenarios!AC53,\"\")","v":0},{"$f":"IFERROR(Scenarios!AD53,\"\")","v":0},{"$f":"IFERROR(Scenarios!AE53,\"\")","v":0},{"$f":"IFERROR(Scenarios!AF53,\"\")","v":0},{"$f":"IFERROR(Scenarios!AG53,\"\")","v":0},{"$f":"IFERROR(Scenarios!AH53,\"\")","v":0},{"$f":"IFERROR(Scenarios!AI53,\"\")","v":0},{"$f":"IFERROR(Scenarios!AJ53,\"\")","v":0},{"$f":"IFERROR(Scenarios!AK53,\"\")","v":0},{"$f":"IFERROR(Scenarios!AL53,\"\")","v":0},{"$f":"IFERROR(Scenarios!AM53,\"\")","v":0},{"$f":"IFERROR(Scenarios!AN53,\"\")","v":0},{"$f":"IFERROR(Scenarios!AO53,\"\")","v":0},{"$f":"IFERROR(Scenarios!AP53,\"\")","v":0},{"$f":"IFERROR(Scenarios!AQ53,\"\")","v":0},{"$f":"IFERROR(Scenarios!AR53,\"\")","v":0},{"$f":"IFERROR(Scenarios!AS53,\"\")","v":0},{"$f":"IFERROR(Scenarios!AT53,\"\")","v":0},{"$f":"IFERROR(Scenarios!AU53,\"\")","v":0},{"$f":"IFERROR(Scenarios!AV53,\"\")","v":0},{"$f":"IFERROR(Scenarios!AW53,\"\")","v":0},{"$f":"IFERROR(Scenarios!AX53,\"\")","v":0},{"$f":"IFERROR(Scenarios!AY53,\"\")","v":0},{"$f":"IFERROR(Scenarios!AZ53,\"\")","v":0},{"$f":"IFERROR(Scenarios!BA53,\"\")","v":0},{"$f":"IFERROR(Scenarios!BB53,\"\")","v":0},{"$f":"IFERROR(Scenarios!BC53,\"\")","v":0},{"$f":"IFERROR(Scenarios!BD53,\"\")","v":0},{"$f":"IFERROR(Scenarios!BE53,\"\")","v":0},{"$f":"IFERROR(Scenarios!BF53,\"\")","v":0},{"$f":"IFERROR(Scenarios!BG53,\"\")","v":0},{"$f":"IFERROR(Scenarios!BH53,\"\")","v":0},{"$f":"IFERROR(Scenarios!BI53,\"\")","v":0},{"$f":"IFERROR(Scenarios!BJ53,\"\")","v":0},{"$f":"IFERROR(Scenarios!BK53,\"\")","v":0},{"$f":"IFERROR(Scenarios!BL53,\"\")","v":0},{"$f":"IFERROR(Scenarios!BM53,\"\")","v":0},{"$f":"IFERROR(Scenarios!BN53,\"\")","v":0},{"$f":"IFERROR(Scenarios!BO53,\"\")","v":0},{"$f":"IFERROR(Scenarios!BP53,\"\")","v":0},{"$f":"IFERROR(Scenarios!BQ53,\"\")","v":0},{"$f":"IFERROR(Scenarios!BR53,\"\")","v":0},{"$f":"IFERROR(Scenarios!BS53,\"\")","v":0},{"$f":"IFERROR(Scenarios!BT53,\"\")","v":0},{"$f":"IFERROR(Scenarios!BU53,\"\")","v":0},{"$f":"IFERROR(Scenarios!BV53,\"\")","v":0},{"$f":"IFERROR(Scenarios!BW53,\"\")","v":0},{"$f":"IFERROR(Scenarios!BX53,\"\")","v":0},{"$f":"IFERROR(Scenarios!BY53,\"\")","v":0},{"$f":"IFERROR(Scenarios!BZ53,\"\")","v":0},{"$f":"IFERROR(Scenarios!CA53,\"\")","v":0},{"$f":"IFERROR(Scenarios!CB53,\"\")","v":0},{"$f":"IFERROR(Scenarios!CC53,\"\")","v":0},{"$f":"IFERROR(Scenarios!CD53,\"\")","v":0},{"$f":"IFERROR(Scenarios!CE53,\"\")","v":0},{"$f":"IFERROR(Scenarios!CF53,\"\")","v":0},{"$f":"IFERROR(Scenarios!CG53,\"\")","v":0},{"$f":"IFERROR(Scenarios!CH53,\"\")","v":0},{"$f":"IFERROR(Scenarios!CI53,\"\")","v":0},{"$f":"IFERROR(Scenarios!CJ53,\"\")","v":0},{"$f":"IFERROR(Scenarios!CK53,\"\")","v":0},{"$f":"IFERROR(Scenarios!CL53,\"\")","v":0},{"$f":"IFERROR(Scenarios!CM53,\"\")","v":0},{"$f":"IFERROR(Scenarios!CN53,\"\")","v":0},{"$f":"IFERROR(Scenarios!CO53,\"\")","v":0},{"$f":"IFERROR(Scenarios!CP53,\"\")","v":0},{"$f":"IFERROR(Scenarios!CQ53,\"\")","v":0},{"$f":"IFERROR(Scenarios!CR53,\"\")","v":0},{"$f":"IFERROR(Scenarios!CS53,\"\")","v":0},{"$f":"IFERROR(Scenarios!CT53,\"\")","v":0},{"$f":"IFERROR(Scenarios!CU53,\"\")","v":0},{"$f":"IFERROR(Scenarios!CV53,\"\")","v":0},{"$f":"IFERROR(Scenarios!CW53,\"\")","v":0},{"$f":"IFERROR(Scenarios!CX53,\"\")","v":0},{"$f":"IFERROR(Scenarios!CY53,\"\")","v":0},{"$f":"IFERROR(Scenarios!CZ53,\"\")","v":0},{"$f":"IFERROR(Scenarios!DA53,\"\")","v":0}]
[{"$f":"IFERROR(Scenarios!A54,\"\")","v":0},{"$f":"IFERROR(Scenarios!B54,\"\")","v":0},{"$f":"IFERROR(Scenarios!C54,\"\")","v":0},{"$f":"IFERROR(Scenarios!D54,\"\")","v":0},{"$f":"IFERROR(Scenarios!E54,\"\")","v":0},{"$f":"IFERROR(Scenarios!F54,\"\")","v":0},{"$f":"IFERROR(Scenarios!G54,\"\")","v":0},{"$f":"IFERROR(Scenarios!H54,\"\")","v":0},{"$f":"IFERROR(Scenarios!I54,\"\")","v":0},{"$f":"IFERROR(Scenarios!J54,\"\")","v":0},{"$f":"IFERROR(Scenarios!K54,\"\")","v":0},{"$f":"IFERROR(Scenarios!L54,\"\")","v":0},{"$f":"IFERROR(Scenarios!M54,\"\")","v":0},{"$f":"IFERROR(Scenarios!N54,\"\")","v":0},{"$f":"IFERROR(Scenarios!O54,\"\")","v":0},{"$f":"IFERROR(Scenarios!P54,\"\")","v":0},{"$f":"IFERROR(Scenarios!Q54,\"\")","v":0},{"$f":"IFERROR(Scenarios!R54,\"\")","v":0},{"$f":"IFERROR(Scenarios!S54,\"\")","v":0},{"$f":"IFERROR(Scenarios!T54,\"\")","v":0},{"$f":"IFERROR(Scenarios!U54,\"\")","v":0},{"$f":"IFERROR(Scenarios!V54,\"\")","v":0},{"$f":"IFERROR(Scenarios!W54,\"\")","v":0},{"$f":"IFERROR(Scenarios!X54,\"\")","v":0},{"$f":"IFERROR(Scenarios!Y54,\"\")","v":0},{"$f":"IFERROR(Scenarios!Z54,\"\")","v":0},{"$f":"IFERROR(Scenarios!AA54,\"\")","v":0},{"$f":"IFERROR(Scenarios!AB54,\"\")","v":0},{"$f":"IFERROR(Scenarios!AC54,\"\")","v":0},{"$f":"IFERROR(Scenarios!AD54,\"\")","v":0},{"$f":"IFERROR(Scenarios!AE54,\"\")","v":0},{"$f":"IFERROR(Scenarios!AF54,\"\")","v":0},{"$f":"IFERROR(Scenarios!AG54,\"\")","v":0},{"$f":"IFERROR(Scenarios!AH54,\"\")","v":0},{"$f":"IFERROR(Scenarios!AI54,\"\")","v":0},{"$f":"IFERROR(Scenarios!AJ54,\"\")","v":0},{"$f":"IFERROR(Scenarios!AK54,\"\")","v":0},{"$f":"IFERROR(Scenarios!AL54,\"\")","v":0},{"$f":"IFERROR(Scenarios!AM54,\"\")","v":0},{"$f":"IFERROR(Scenarios!AN54,\"\")","v":0},{"$f":"IFERROR(Scenarios!AO54,\"\")","v":0},{"$f":"IFERROR(Scenarios!AP54,\"\")","v":0},{"$f":"IFERROR(Scenarios!AQ54,\"\")","v":0},{"$f":"IFERROR(Scenarios!AR54,\"\")","v":0},{"$f":"IFERROR(Scenarios!AS54,\"\")","v":0},{"$f":"IFERROR(Scenarios!AT54,\"\")","v":0},{"$f":"IFERROR(Scenarios!AU54,\"\")","v":0},{"$f":"IFERROR(Scenarios!AV54,\"\")","v":0},{"$f":"IFERROR(Scenarios!AW54,\"\")","v":0},{"$f":"IFERROR(Scenarios!AX54,\"\")","v":0},{"$f":"IFERROR(Scenarios!AY54,\"\")","v":0},{"$f":"IFERROR(Scenarios!AZ54,\"\")","v":0},{"$f":"IFERROR(Scenarios!BA54,\"\")","v":0},{"$f":"IFERROR(Scenarios!BB54,\"\")","v":0},{"$f":"IFERROR(Scenarios!BC54,\"\")","v":0},{"$f":"IFERROR(Scenarios!BD54,\"\")","v":0},{"$f":"IFERROR(Scenarios!BE54,\"\")","v":0},{"$f":"IFERROR(Scenarios!BF54,\"\")","v":0},{"$f":"IFERROR(Scenarios!BG54,\"\")","v":0},{"$f":"IFERROR(Scenarios!BH54,\"\")","v":0},{"$f":"IFERROR(Scenarios!BI54,\"\")","v":0},{"$f":"IFERROR(Scenarios!BJ54,\"\")","v":0},{"$f":"IFERROR(Scenarios!BK54,\"\")","v":0},{"$f":"IFERROR(Scenarios!BL54,\"\")","v":0},{"$f":"IFERROR(Scenarios!BM54,\"\")","v":0},{"$f":"IFERROR(Scenarios!BN54,\"\")","v":0},{"$f":"IFERROR(Scenarios!BO54,\"\")","v":0},{"$f":"IFERROR(Scenarios!BP54,\"\")","v":0},{"$f":"IFERROR(Scenarios!BQ54,\"\")","v":0},{"$f":"IFERROR(Scenarios!BR54,\"\")","v":0},{"$f":"IFERROR(Scenarios!BS54,\"\")","v":0},{"$f":"IFERROR(Scenarios!BT54,\"\")","v":0},{"$f":"IFERROR(Scenarios!BU54,\"\")","v":0},{"$f":"IFERROR(Scenarios!BV54,\"\")","v":0},{"$f":"IFERROR(Scenarios!BW54,\"\")","v":0},{"$f":"IFERROR(Scenarios!BX54,\"\")","v":0},{"$f":"IFERROR(Scenarios!BY54,\"\")","v":0},{"$f":"IFERROR(Scenarios!BZ54,\"\")","v":0},{"$f":"IFERROR(Scenarios!CA54,\"\")","v":0},{"$f":"IFERROR(Scenarios!CB54,\"\")","v":0},{"$f":"IFERROR(Scenarios!CC54,\"\")","v":0},{"$f":"IFERROR(Scenarios!CD54,\"\")","v":0},{"$f":"IFERROR(Scenarios!CE54,\"\")","v":0},{"$f":"IFERROR(Scenarios!CF54,\"\")","v":0},{"$f":"IFERROR(Scenarios!CG54,\"\")","v":0},{"$f":"IFERROR(Scenarios!CH54,\"\")","v":0},{"$f":"IFERROR(Scenarios!CI54,\"\")","v":0},{"$f":"IFERROR(Scenarios!CJ54,\"\")","v":0},{"$f":"IFERROR(Scenarios!CK54,\"\")","v":0},{"$f":"IFERROR(Scenarios!CL54,\"\")","v":0},{"$f":"IFERROR(Scenarios!CM54,\"\")","v":0},{"$f":"IFERROR(Scenarios!CN54,\"\")","v":0},{"$f":"IFERROR(Scenarios!CO54,\"\")","v":0},{"$f":"IFERROR(Scenarios!CP54,\"\")","v":0},{"$f":"IFERROR(Scenarios!CQ54,\"\")","v":0},{"$f":"IFERROR(Scenarios!CR54,\"\")","v":0},{"$f":"IFERROR(Scenarios!CS54,\"\")","v":0},{"$f":"IFERROR(Scenarios!CT54,\"\")","v":0},{"$f":"IFERROR(Scenarios!CU54,\"\")","v":0},{"$f":"IFERROR(Scenarios!CV54,\"\")","v":0},{"$f":"IFERROR(Scenarios!CW54,\"\")","v":0},{"$f":"IFERROR(Scenarios!CX54,\"\")","v":0},{"$f":"IFERROR(Scenarios!CY54,\"\")","v":0},{"$f":"IFERROR(Scenarios!CZ54,\"\")","v":0},{"$f":"IFERROR(Scenarios!DA54,\"\")","v":0}]
[{"$f":"IFERROR(Scenarios!A55,\"\")","v":0},{"$f":"IFERROR(Scenarios!B55,\"\")","v":0},{"$f":"IFERROR(Scenarios!C55,\"\")","v":0},{"$f":"IFERROR(Scenarios!D55,\"\")","v":0},{"$f":"IFERROR(Scenarios!E55,\"\")","v":0},{"$f":"IFERROR(Scenarios!F55,\"\")","v":0},{"$f":"IFERROR(Scenarios!G55,\"\")","v":0},{"$f":"IFERROR(Scenarios!H55,\"\")","v":0},{"$f":"IFERROR(Scenarios!I55,\"\")","v":0},{"$f":"IFERROR(Scenarios!J55,\"\")","v":0},{"$f":"IFERROR(Scenarios!K55,\"\")","v":0},{"$f":"IFERROR(Scenarios!L55,\"\")","v":0},{"$f":"IFERROR(Scenarios!M55,\"\")","v":0},{"$f":"IFERROR(Scenarios!N55,\"\")","v":0},{"$f":"IFERROR(Scenarios!O55,\"\")","v":0},{"$f":"IFERROR(Scenarios!P55,\"\")","v":0},{"$f":"IFERROR(Scenarios!Q55,\"\")","v":0},{"$f":"IFERROR(Scenarios!R55,\"\")","v":0},{"$f":"IFERROR(Scenarios!S55,\"\")","v":0},{"$f":"IFERROR(Scenarios!T55,\"\")","v":0},{"$f":"IFERROR(Scenarios!U55,\"\")","v":0},{"$f":"IFERROR(Scenarios!V55,\"\")","v":0},{"$f":"IFERROR(Scenarios!W55,\"\")","v":0},{"$f":"IFERROR(Scenarios!X55,\"\")","v":0},{"$f":"IFERROR(Scenarios!Y55,\"\")","v":0},{"$f":"IFERROR(Scenarios!Z55,\"\")","v":0},{"$f":"IFERROR(Scenarios!AA55,\"\")","v":0},{"$f":"IFERROR(Scenarios!AB55,\"\")","v":0},{"$f":"IFERROR(Scenarios!AC55,\"\")","v":0},{"$f":"IFERROR(Scenarios!AD55,\"\")","v":0},{"$f":"IFERROR(Scenarios!AE55,\"\")","v":0},{"$f":"IFERROR(Scenarios!AF55,\"\")","v":0},{"$f":"IFERROR(Scenarios!AG55,\"\")","v":0},{"$f":"IFERROR(Scenarios!AH55,\"\")","v":0},{"$f":"IFERROR(Scenarios!AI55,\"\")","v":0},{"$f":"IFERROR(Scenarios!AJ55,\"\")","v":0},{"$f":"IFERROR(Scenarios!AK55,\"\")","v":0},{"$f":"IFERROR(Scenarios!AL55,\"\")","v":0},{"$f":"IFERROR(Scenarios!AM55,\"\")","v":0},{"$f":"IFERROR(Scenarios!AN55,\"\")","v":0},{"$f":"IFERROR(Scenarios!AO55,\"\")","v":0},{"$f":"IFERROR(Scenarios!AP55,\"\")","v":0},{"$f":"IFERROR(Scenarios!AQ55,\"\")","v":0},{"$f":"IFERROR(Scenarios!AR55,\"\")","v":0},{"$f":"IFERROR(Scenarios!AS55,\"\")","v":0},{"$f":"IFERROR(Scenarios!AT55,\"\")","v":0},{"$f":"IFERROR(Scenarios!AU55,\"\")","v":0},{"$f":"IFERROR(Scenarios!AV55,\"\")","v":0},{"$f":"IFERROR(Scenarios!AW55,\"\")","v":0},{"$f":"IFERROR(Scenarios!AX55,\"\")","v":0},{"$f":"IFERROR(Scenarios!AY55,\"\")","v":0},{"$f":"IFERROR(Scenarios!AZ55,\"\")","v":0},{"$f":"IFERROR(Scenarios!BA55,\"\")","v":0},{"$f":"IFERROR(Scenarios!BB55,\"\")","v":0},{"$f":"IFERROR(Scenarios!BC55,\"\")","v":0},{"$f":"IFERROR(Scenarios!BD55,\"\")","v":0},{"$f":"IFERROR(Scenarios!BE55,\"\")","v":0},{"$f":"IFERROR(Scenarios!BF55,\"\")","v":0},{"$f":"IFERROR(Scenarios!BG55,\"\")","v":0},{"$f":"IFERROR(Scenarios!BH55,\"\")","v":0},{"$f":"IFERROR(Scenarios!BI55,\"\")","v":0},{"$f":"IFERROR(Scenarios!BJ55,\"\")","v":0},{"$f":"IFERROR(Scenarios!BK55,\"\")","v":0},{"$f":"IFERROR(Scenarios!BL55,\"\")","v":0},{"$f":"IFERROR(Scenarios!BM55,\"\")","v":0},{"$f":"IFERROR(Scenarios!BN55,\"\")","v":0},{"$f":"IFERROR(Scenarios!BO55,\"\")","v":0},{"$f":"IFERROR(Scenarios!BP55,\"\")","v":0},{"$f":"IFERROR(Scenarios!BQ55,\"\")","v":0},{"$f":"IFERROR(Scenarios!BR55,\"\")","v":0},{"$f":"IFERROR(Scenarios!BS55,\"\")","v":0},{"$f":"IFERROR(Scenarios!BT55,\"\")","v":0},{"$f":"IFERROR(Scenarios!BU55,\"\")","v":0},{"$f":"IFERROR(Scenarios!BV55,\"\")","v":0},{"$f":"IFERROR(Scenarios!BW55,\"\")","v":0},{"$f":"IFERROR(Scenarios!BX55,\"\")","v":0},{"$f":"IFERROR(Scenarios!BY55,\"\")","v":0},{"$f":"IFERROR(Scenarios!BZ55,\"\")","v":0},{"$f":"IFERROR(Scenarios!CA55,\"\")","v":0},{"$f":"IFERROR(Scenarios!CB55,\"\")","v":0},{"$f":"IFERROR(Scenarios!CC55,\"\")","v":0},{"$f":"IFERROR(Scenarios!CD55,\"\")","v":0},{"$f":"IFERROR(Scenarios!CE55,\"\")","v":0},{"$f":"IFERROR(Scenarios!CF55,\"\")","v":0},{"$f":"IFERROR(Scenarios!CG55,\"\")","v":0},{"$f":"IFERROR(Scenarios!CH55,\"\")","v":0},{"$f":"IFERROR(Scenarios!CI55,\"\")","v":0},{"$f":"IFERROR(Scenarios!CJ55,\"\")","v":0},{"$f":"IFERROR(Scenarios!CK55,\"\")","v":0},{"$f":"IFERROR(Scenarios!CL55,\"\")","v":0},{"$f":"IFERROR(Scenarios!CM55,\"\")","v":0},{"$f":"IFERROR(Scenarios!CN55,\"\")","v":0},{"$f":"IFERROR(Scenarios!CO55,\"\")","v":0},{"$f":"IFERROR(Scenarios!CP55,\"\")","v":0},{"$f":"IFERROR(Scenarios!CQ55,\"\")","v":0},{"$f":"IFERROR(Scenarios!CR55,\"\")","v":0},{"$f":"IFERROR(Scenarios!CS55,\"\")","v":0},{"$f":"IFERROR(Scenarios!CT55,\"\")","v":0},{"$f":"IFERROR(Scenarios!CU55,\"\")","v":0},{"$f":"IFERROR(Scenarios!CV55,\"\")","v":0},{"$f":"IFERROR(Scenarios!CW55,\"\")","v":0},{"$f":"IFERROR(Scenarios!CX55,\"\")","v":0},{"$f":"IFERROR(Scenarios!CY55,\"\")","v":0},{"$f":"IFERROR(Scenarios!CZ55,\"\")","v":0},{"$f":"IFERROR(Scenarios!DA55,\"\")","v":0}]
[{"$f":"IFERROR(Scenarios!A56,\"\")","v":0},{"$f":"IFERROR(Scenarios!B56,\"\")","v":0},{"$f":"IFERROR(Scenarios!C56,\"\")","v":0},{"$f":"IFERROR(Scenarios!D56,\"\")","v":0},{"$f":"IFERROR(Scenarios!E56,\"\")","v":0},{"$f":"IFERROR(Scenarios!F56,\"\")","v":0},{"$f":"IFERROR(Scenarios!G56,\"\")","v":0},{"$f":"IFERROR(Scenarios!H56,\"\")","v":0},{"$f":"IFERROR(Scenarios!I56,\"\")","v":0},{"$f":"IFERROR(Scenarios!J56,\"\")","v":0},{"$f":"IFERROR(Scenarios!K56,\"\")","v":0},{"$f":"IFERROR(Scenarios!L56,\"\")","v":0},{"$f":"IFERROR(Scenarios!M56,\"\")","v":0},{"$f":"IFERROR(Scenarios!N56,\"\")","v":0},{"$f":"IFERROR(Scenarios!O56,\"\")","v":0},{"$f":"IFERROR(Scenarios!P56,\"\")","v":0},{"$f":"IFERROR(Scenarios!Q56,\"\")","v":0},{"$f":"IFERROR(Scenarios!R56,\"\")","v":0},{"$f":"IFERROR(Scenarios!S56,\"\")","v":0},{"$f":"IFERROR(Scenarios!T56,\"\")","v":0},{"$f":"IFERROR(Scenarios!U56,\"\")","v":0},{"$f":"IFERROR(Scenarios!V56,\"\")","v":0},{"$f":"IFERROR(Scenarios!W56,\"\")","v":0},{"$f":"IFERROR(Scenarios!X56,\"\")","v":0},{"$f":"IFERROR(Scenarios!Y56,\"\")","v":0},{"$f":"IFERROR(Scenarios!Z56,\"\")","v":0},{"$f":"IFERROR(Scenarios!AA56,\"\")","v":0},{"$f":"IFERROR(Scenarios!AB56,\"\")","v":0},{"$f":"IFERROR(Scenarios!AC56,\"\")","v":0},{"$f":"IFERROR(Scenarios!AD56,\"\")","v":0},{"$f":"IFERROR(Scenarios!AE56,\"\")","v":0},{"$f":"IFERROR(Scenarios!AF56,\"\")","v":0},{"$f":"IFERROR(Scenarios!AG56,\"\")","v":0},{"$f":"IFERROR(Scenarios!AH56,\"\")","v":0},{"$f":"IFERROR(Scenarios!AI56,\"\")","v":0},{"$f":"IFERROR(Scenarios!AJ56,\"\")","v":0},{"$f":"IFERROR(Scenarios!AK56,\"\")","v":0},{"$f":"IFERROR(Scenarios!AL56,\"\")","v":0},{"$f":"IFERROR(Scenarios!AM56,\"\")","v":0},{"$f":"IFERROR(Scenarios!AN56,\"\")","v":0},{"$f":"IFERROR(Scenarios!AO56,\"\")","v":0},{"$f":"IFERROR(Scenarios!AP56,\"\")","v":0},{"$f":"IFERROR(Scenarios!AQ56,\"\")","v":0},{"$f":"IFERROR(Scenarios!AR56,\"\")","v":0},{"$f":"IFERROR(Scenarios!AS56,\"\")","v":0},{"$f":"IFERROR(Scenarios!AT56,\"\")","v":0},{"$f":"IFERROR(Scenarios!AU56,\"\")","v":0},{"$f":"IFERROR(Scenarios!AV56,\"\")","v":0},{"$f":"IFERROR(Scenarios!AW56,\"\")","v":0},{"$f":"IFERROR(Scenarios!AX56,\"\")","v":0},{"$f":"IFERROR(Scenarios!AY56,\"\")","v":0},{"$f":"IFERROR(Scenarios!AZ56,\"\")","v":0},{"$f":"IFERROR(Scenarios!BA56,\"\")","v":0},{"$f":"IFERROR(Scenarios!BB56,\"\")","v":0},{"$f":"IFERROR(Scenarios!BC56,\"\")","v":0},{"$f":"IFERROR(Scenarios!BD56,\"\")","v":0},{"$f":"IFERROR(Scenarios!BE56,\"\")","v":0},{"$f":"IFERROR(Scenarios!BF56,\"\")","v":0},{"$f":"IFERROR(Scenarios!BG56,\"\")","v":0},{"$f":"IFERROR(Scenarios!BH56,\"\")","v":0},{"$f":"IFERROR(Scenarios!BI56,\"\")","v":0},{"$f":"IFERROR(Scenarios!BJ56,\"\")","v":0},{"$f":"IFERROR(Scenarios!BK56,\"\")","v":0},{"$f":"IFERROR(Scenarios!BL56,\"\")","v":0},{"$f":"IFERROR(Scenarios!BM56,\"\")","v":0},{"$f":"IFERROR(Scenarios!BN56,\"\")","v":0},{"$f":"IFERROR(Scenarios!BO56,\"\")","v":0},{"$f":"IFERROR(Scenarios!BP56,\"\")","v":0},{"$f":"IFERROR(Scenarios!BQ56,\"\")","v":0},{"$f":"IFERROR(Scenarios!BR56,\"\")","v":0},{"$f":"IFERROR(Scenarios!BS56,\"\")","v":0},{"$f":"IFERROR(Scenarios!BT56,\"\")","v":0},{"$f":"IFERROR(Scenarios!BU56,\"\")","v":0},{"$f":"IFERROR(Scenarios!BV56,\"\")","v":0},{"$f":"IFERROR(Scenarios!BW56,\"\")","v":0},{"$f":"IFERROR(Scenarios!BX56,\"\")","v":0},{"$f":"IFERROR(Scenarios!BY56,\"\")","v":0},{"$f":"IFERROR(Scenarios!BZ56,\"\")","v":0},{"$f":"IFERROR(Scenarios!CA56,\"\")","v":0},{"$f":"IFERROR(Scenarios!CB56,\"\")","v":0},{"$f":"IFERROR(Scenarios!CC56,\"\")","v":0},{"$f":"IFERROR(Scenarios!CD56,\"\")","v":0},{"$f":"IFERROR(Scenarios!CE56,\"\")","v":0},{"$f":"IFERROR(Scenarios!CF56,\"\")","v":0},{"$f":"IFERROR(Scenarios!CG56,\"\")","v":0},{"$f":"IFERROR(Scenarios!CH56,\"\")","v":0},{"$f":"IFERROR(Scenarios!CI56,\"\")","v":0},{"$f":"IFERROR(Scenarios!CJ56,\"\")","v":0},{"$f":"IFERROR(Scenarios!CK56,\"\")","v":0},{"$f":"IFERROR(Scenarios!CL56,\"\")","v":0},{"$f":"IFERROR(Scenarios!CM56,\"\")","v":0},{"$f":"IFERROR(Scenarios!CN56,\"\")","v":0},{"$f":"IFERROR(Scenarios!CO56,\"\")","v":0},{"$f":"IFERROR(Scenarios!CP56,\"\")","v":0},{"$f":"IFERROR(Scenarios!CQ56,\"\")","v":0},{"$f":"IFERROR(Scenarios!CR56,\"\")","v":0},{"$f":"IFERROR(Scenarios!CS56,\"\")","v":0},{"$f":"IFERROR(Scenarios!CT56,\"\")","v":0},{"$f":"IFERROR(Scenarios!CU56,\"\")","v":0},{"$f":"IFERROR(Scenarios!CV56,\"\")","v":0},{"$f":"IFERROR(Scenarios!CW56,\"\")","v":0},{"$f":"IFERROR(Scenarios!CX56,\"\")","v":0},{"$f":"IFERROR(Scenarios!CY56,\"\")","v":0},{"$f":"IFERROR(Scenarios!CZ56,\"\")","v":0},{"$f":"IFERROR(Scenarios!DA56,\"\")","v":0}]

{"sheet":"Native Vegetation","index":8,"n_rows":98,"n_cols":3,"rows_kept":98,"cut":false,"hidden":false,"merged":[[8,1,17,6],[70,2,72,10],[76,2,79,10],[48,2,50,10],[54,2,58,10],[52,2,53,10],[61,2,62,10],[42,1,45,10],[65,1,67,10],[83,1,89,10],[26,2,28,10],[31,2,33,10],[36,2,39,10],[22,1,23,10]]}
[]
[null,"Native Vegetation"]
[]
[]
[]
[null,"Native Vegetation"]
[]
[]
[null,"Native vegetation includes those plants that are endemic to the local environment and are thus well adapted to local features such as climate, soil, and water availability.1   Landscaping with native plants can lessen the need for pesticides and herbicides, reduce demand for water, and increase the types and number of species in the area.  Additionally, designing with a variety of native trees, shrubs, grasses and wildflowers can require less money and maintenance than conventional landscapes.2"]
[]
[]
[]
[]
[]
[]
[]
[]
[]
[]
[null,"Best Practices and Benefits by Category"]
[]
[null,"Habitat Expansion3"]
[null,"Pennsylvania wildlife has evolved to exist among native Pennsylvania plant species.  Using native vegetation establishes plant communities that are familiar and beneficial to local wildlife.  "]
[]
[]
[null,"1.","As a best practice, group trees, shrubs, and perennials together to create layers of vegetation. "]
[null,null,"Benefits: Plants are one of the most important features of an animal’s habitat since they provide a variety of habitat needs. Creating layers of vegetation provides the structure and plant variety needed for shelter, breeding, and nesting.  "]
[]
[]
[]
[null,"2.","As a best practice, create puddles, pools, or a small pond to provide water year-round. "]
[null,null,"Benefits:  Puddles, pools, and ponds provide a year-round source of water to animals while becoming a home to amphibians and aquatic insects. Running or circulating water will attract wildlife and prevent mosquito growth.  "]
[]
[]
[]
[null,"3.","As a best practice, provide a variety of natural areas for insects, birds, and small mammals. "]
[null,null,"Benefits: Providing a variety of native vegetation will support micro-ecosystems by attracting diverse animals and insects.  Incorporating rock walls or piles, stacked wood, or brush piles provide homes for insects, certain birds and small mammals.  Additionally, standing dead tree trunks benefit cavity-nesting wildlife such as woodpeckers.  "]
[]
[]
[]
[]
[null,"Landscape Resiliency"]
[null,"Native vegetation is generally better adapted to regional characteristics, such as amount of sunlight, temperature, water, and soil acidity.  Native plans are often tolerant of local climatic conditions and therefore require less irrigation.  They can also be better than non-native species at uptaking nutrients from the soil, which requires less fertilizer application.  "]
[]
[]
[]
[]
[null,"1.","As a best practice, choose plants that will grow well at the specific site.4"]
[null,null,"Benefits: When landscaping with native vegetation it is important to choose plants that will grow well at the site.  Consider moisture, wet or dry, amount of direct sunlight, shade or sunlight, and type of soil, acid or neutral."]
[]
[]
[]
[null,"2.","As a best practice, don’t over fertilize native plants.  If necessary, apply a slow-release organic fertilizer once a year in the fall.5"]
[]
[null,null,"Benefits: Most native plants will not need fertilizer once they are established.  When fertilizers are used, it is best practice to use organic or slow-release varieties, and should be used in as small a quantity as possible.  Reducing application of fertilizers decreases costs for lawn maintenance and decreases the amount of fertilizer that enters local waterways.  Too much fertilizer in rivers, lakes, and ponds can lead to excessive amounts of algae and eutrophication, which can kill fish and other animals due to depleted oxygen levels."]
[]
[]
[]
[]
[]
[null,"3.","As a best practice, protect and maintain existing trees.6"]
[null,null,"Benefits: Mature trees enhance air quality and reduce pollution, enhance water quality and reduce erosion, and can reduce energy costs when properly planted around a building."]
[]
[]
[null,"Weed Control7"]
[null,"Once established native plants suppress weeds by outcompeting them for soil nutrients, groundspace, and sunlight.  As a result, native plants lessen the need to apply herbicides and pesticides.  Native vegetation can also be used to address areas with problems such as erosion, steep slopes, or poor drainage."]
[]
[]
[]
[null,"1.","As a best practice, spot spray herbicides."]
[null,null,"Benefits: Spot spraying weeds—by targeting weeds that require herbicide application as opposed to blanket herbicide application—cuts down on the amount of herbicide that needs to be applied.  This saves money and lessens environmental impacts associated with herbicide use. "]
[]
[]
[null,null,"Note: carefully read and follow the manufacturer’s mixing and application directions."]
[]
[null,"2.","As a best practice, use native vegetation on slopes that may be difficult to mow."]
[null,null,"Benefits:  Native vegetation grown on steep slopes can stabilize the soil while eliminating the need to mow challenging or dangerous areas.  Those native species that have dense and deep root systems (such as native grasses) prevent soil erosion and slop failure and prevent weeds from otherwise growing in these areas."]
[]
[]
[]
[]
[null,"Education and Outreach"]
[]
[null,"The general public and other stakeholders may express concerns over the use of native vegetation as opposed to conventional lawns.  To increase awareness of the benefits of native vegetation, localities can provide interpretive kiosks and other materials that highlight the types of insects and animals that may exist among the native plants that otherwise would not be present.  Interpretive materials could also note the reduced need for herbicides, pesticides, and fertilizer and the associated benefits to local water quality and species diversity.  Additionally, localities could host bug catch-and-release events to highlight the variety and diversity of species found among the native vegetation."]
[]
[]
[]
[]
[]
[]
[]
[null,"1  Native plants are distinct from non-native plants, which have been brought into the local environment from other locations by human activity."]
[null,"2 http://www.nps.gov/plants/pubs/chesapeake/pdf/chesapeakenatives.pdf"]
[null,"3 http://www.dcnr.state.pa.us/forestry/plants/nativeplants/index.htm "]
[null,"4 http://www.dcnr.state.pa.us/forestry/plants/nativeplants/index.htm"]
[null,"5 http://www.dcnr.state.pa.us/cs/groups/public/documents/document/dcnr_006236.pdf"]
[null,"6 http://www.dcnr.state.pa.us/cs/groups/public/documents/document/dcnr_006236.pdf"]
[null,"7 http://www.lrrb.org/media/reports/200820.pdf"]

{"sheet":"Grasscycling","index":9,"n_rows":76,"n_cols":3,"rows_kept":76,"cut":false,"hidden":false,"merged":[[26,2,28,10],[21,2,23,10],[8,1,12,11],[17,1,18,10],[31,1,34,10],[37,2,40,10],[43,2,47,10],[50,2,51,10],[55,2,57,11],[64,2,65,11],[53,2,54,10],[60,2,61,10]]}
[]
[null,"Grasscycling"]
[]
[]
[]
[null,"Grasscycling"]
[]
[]
[null,"Grasscycling is the practice of leaving grass clippings on the lawn rather than bagging and disposing of them.  Grass clippings are mostly composed of leaf tissue and thus decompose rapidly.  Grass clippings can contribute a substantial amount of nitrogen and other nutrients to the soil, which fertilizes the lawn naturally.  Any well-maintained lawn mower is capable of grasscycling.   Grasscycling reduces waste and fertilizer use, eliminates time spent bagging, and makes lawns healthier and more resilient."]
[]
[]
[]
[]
[]
[null,"Best Practices and Benefits by Category"]
[]
[null,"Reduced Waste1"]
[null,"Grasscycling reduces the amount of waste sent to the landfill, which can cut down on disposal costs and reduce landfilled waste."]
[]
[]
[null,"1.","As a best practice, cut grass when it is dry. "]
[null,null,"Benefits: Clumping can occur if grass is too moist when mowed, which encourages bagging for disposal.  Consider an alternative use for clumps and place them around trees and shrubs as mulch.  Cut grass when it is dry so the clippings will scatter rather than clump, or run the mower back over any clumps.2"]
[]
[]
[]
[null,"2.","As a best practice, keep the mower blades sharp.3"]
[null,null,"Benefits: Sharp blades result in shorter grass clippings, which promote faster decomposition rates and can produce an attractive and healthy lawn. Shorter grass clippings also hide better, discouraging bagging.4"]
[]
[]
[]
[null,"Reduced Fertilizer Use5"]
[null,"Proper fertilization is essential in maintaining a healthy lawn. However, applying too much fertilization can cause excessive top growth.  Grass clippings left on the lawn can increase the amount of nutrients absorbed by the lawn and thereby reduce the amount of fertilizer needed to maintain a healthy and green space."]
[]
[]
[]
[]
[null,"1.","As a best practice, know your soil."]
[null,null,"Benefits: If you are applying fertilizer to your lawn without first understanding your soil’s requirements, you are probably wasting your hard-earned money. Contact your County Cooperative Extension Office or Penn State’s Agricultural Services Lab for a soil test kit and learn about your lawn soil’s strengths and weaknesses. "]
[]
[]
[]
[]
[null,"2.","As a best practice, timing is everything. "]
[null,null,"Benefits: If you are going to apply a fertilizer the ideal periods for application take place between the last lawn mowing and Thanksgiving and the first two weeks in September, when fertilizer will feed the roots, not the leaves.  Spring fertilization encourages leaf growth and feeds weed species.  If you must fertilize in the spring, do it in early May.  Never fertilize in the summer.  Most lawn grasses are cool season species, which die back during the heat of the summer."]
[]
[]
[]
[]
[]
[null,"3.","As a best practice, use fertilizers that contain slow-release nitrogen.7"]
[null,null,"Benefits: Slow-release nitrogen fertilizers promote slower, more uniform growth.  Recommended types include methylene urea, ureaformaldehyde, sulfur-coated urea, or isobutylidene diurea (IBDU). "]
[]
[]
[null,"4.","As a best practice, apply smaller quantities of fertilizer more frequently rather than larger amounts less frequently."]
[]
[null,null,"Benefits: Most grasses need modest amounts of fertilizer.  Those that benefit from grasscycling require less fertilizer than those lawns where grass clippings are removed. Decreasing the amount of fertilizer per application can increase the absorption of nutrients into the soil.  "]
[]
[]
[]
[null,"5.","As a best practice, leave grass clippings on the lawn to recycle plant nutrients back into the soil.8"]
[null,null,"Benefits: Grass clippings contain the same beneficial nitrogen, phosphorus, and potassium nutrients as fertilizer. Clippings can provide up to one-third of the annual feeding requirement for your lawn if your soil already contains the proper amount of nutrients."]
[]
[]
[null,"6.","As a best practice, cut up to one-third of the height to reduce water loss from evaporation.9"]
[null,null,"Benefits:  Maintaining the proper length on your lawn produces grass clippings that help conserve water because the grass clippings left on the lawn reduce water loss from evaporation by keeping the soil cool. "]
[]
[]
[null,"1 http://www.extension.umn.edu/garden/landscaping/maint/maint.htm"]
[null,"2 http://www.frederickcountymd.gov/index.aspx?NID=566"]
[null,"3 http://www.dep.state.pa.us/dep/deputate/airwaste/wm/recycle/document/letitlay.htm"]
[null,"4 http://www.calgary.ca/UEP/WRS/Pages/Recycling-information/Residential-services/Organics-recycling/Grasscycling.aspx"]
[null,"5 http://www.calrecycle.ca.gov/organics/grasscycling/HowTo.htm"]
[null,"6 http://tinicumconservancy.org/pdfs/Environmentally%20Friendly%20Lawn.pdf "]
[null,"7 http://www.dep.state.pa.us/dep/deputate/airwaste/wm/recycle/document/letitlay.htm"]
[null,"8 http://ofswcd.org/files/Download/Backyard%20Conservation%20Lawn%20Care%20Practices%20speaker%20notes%20Final.pdf"]
[null,"9 http://www.baltimorecountymd.gov/Agencies/publicworks/recycling/composting/grasscycling.html"]

{"sheet":"Maintenance","index":10,"n_rows":89,"n_cols":3,"rows_kept":89,"cut":false,"hidden":false,"merged":[[72,2,75,10],[67,2,69,10],[45,2,47,10],[62,2,64,10],[27,2,29,10],[32,2,35,10],[8,1,9,10],[14,1,15,10],[38,1,42,10],[56,1,58,10],[50,2,53,10],[17,2,18,10],[19,2,23,10],[25,2,26,10]]}
[]
[null,"Mower Maintenance"]
[]
[]
[]
[null,"Mower Maintenance"]
[]
[]
[null,"Proper mower maintenance will result in decreased mower emissions (carbon and other pollutants), reduced fuel consumption, extended lifetime of the equipment, and improved local air quality. "]
[]
[]
[null,"Best Practices and Benefits by Category"]
[]
[null,"Fuel Use Tips1"]
[null,"Proper mower refueling practices has many benefits including reduced fuel consumption and minimizing storm water pollution."]
[]
[]
[null,"1.","As a best practice, check the oil level regularly and only fill the fuel tank three-quarters full, allowing room for expansion without overflow.  "]
[]
[null,null,"Benefits: Ideally, you should check the oil level every time you mow. If you have a new mower, change the oil after the first five hours of use. After that, change the oil after every 50 hours of use or at the beginning of each lawn care season.2  Knowing your oil level will also help in avoiding overflow of your fuel tank. When fueling lawn and garden equipment use a funnel and pour slowly.3  The avoidance of overflowed fuel will also reduce storm water pollution.4"]
[]
[]
[]
[]
[]
[null,"2.","As a best practice, close the fuel container’s vent and keep gas cans out of direct sunlight to reduce fuel evaporation. "]
[]
[null,null,"Benefits: At high heat, such as in summer months, gas can evaporate from the fuel container if it is poorly fitted or sealed.5  Be sure to check that your fuel tank cap is properly closed and avoid storing your gas can in direct sunlight."]
[]
[]
[]
[null,"3.","As a best practice, do not use old fuel or fuel that has sat all winter without a stabilizer in it. "]
[null,null,"Benefits: Add a stabilizer (fuel preserver) according to package directions and run the mower for a few minutes so the stabilizer circulates through the carburetor.  The stabilizer keeps fuel fresh for up to 6 months.  When storing your mower for the winter, fill the tank.  This will help prevent moisture from condensing in the tank which can form rust that could break away and clog the carburetor.  "]
[]
[]
[]
[]
[null,"Lower Carbon Footprint"]
[null,"Implementing best practices for mower maintenance can lead to decreased mower emissions and fuel consumption. These tips can reduce the amount of carbon and pollutants affecting air quality. For example, gasoline powered lawn mowers contribute to local air pollution.  Therefore modifications to how you refuel your lawn mower and frequency of tune-ups can result in lowering the carbon impact of lawn mowers.   "]
[]
[]
[]
[]
[]
[null,"1.","As a best practice, use high quality detergent oil, such as 30MW or 10W-30, to reduce emissions.6"]
[null,null,"Benefits: Burning higher quality detergent oil can reduce damage to the converter, resulting in lower emissions and more efficient machinery.  A reduction in emissions lowers the carbon footprint of the activity, decreasing the amount of pollutants entering the air. "]
[]
[]
[]
[null,"2.","As a best practice, keep the mower engine properly tuned. "]
[null,null,"Benefits:  Regular tune-ups can add years to a mower and help reduce a mower’s emissions up to 50 percent.  Also, more horsepower can be applied to cutting the grass instead of running an inefficient engine.  Tune-ups can include checking the oil level, changing oil, replacing air and oil filters, and replacing spark plugs.7"]
[]
[]
[]
[]
[null,"Wear and Tear8"]
[null,"Regular maintenance of lawn equipment can reduce gasoline consumption and extend the lifetime of the equipment. Proper maintenance can include replacing air filters, changing oil, and sharpening mower blades. These practices can also increase equipment efficiency and reduce associated emissions.9"]
[]
[]
[null,"Refer to your mower’s user manual for specific guidelines."]
[]
[null,"1.","As a best practice, clean or replace the air filter after 25 hours of use or every season.10"]
[null,null,"Benefits: The air filter prevents dirt, dust, and grass clippings from entering the carburetor and engine. , where debris can create excess wear on engine parts or reduce engine power. If you operate under dusty or heavy load conditions, consider cleaning or replacing the air filter more frequently. "]
[]
[]
[]
[null,"2.","As a best practice, change the engine oil after 20-25 hours of use.11"]
[null,null,"Benefits: Changing the oil of your lawn mower is critical to its long term performance. Clean, fresh oil will help an engine start quickly and operate more efficiently. Remember to recycle the old oil to a certified oil recycling center or refer to your community’s disposal guidelines. "]
[]
[]
[]
[null,"3.","As a best practice, keep the mower blade sharp and the underside of the deck clean.12"]
[null,null,"Benefits: Dull mower blades can cut inconsistently, unevenly, or it may not cut at all. Additionally, dull blades can cause leaf tips to become frayed and cause grass to become more susceptible to disease, insects, and weeds.  In addition, sharp blades help extend the life of the mower because the engine will not have to work as hard to produce the same results. "]
[]
[]
[]
[]
[null,"1 http://www.basco.com/Sustainability/Reducing%20Mower%20Emissions/"]
[null,"2 http://www.briggsandstratton.com/us/en/support/maintenance-how-to/push-mower-engines/how-to-maintain-your-mower-engine"]
[null,"3 http://www.kdheks.gov/bar/air_outreach/calc.html"]
[null,"4 http://greenscapes.org/?page_id=220"]
[null,"5 http://drivesmarterchallenge.org/money-saving-tips/myths.aspx"]
[null,"6 http://www.precisionenginetech.com/tech-explained/2009/06/01/choosing-the-right-oil-part-1/"]
[null,"7 http://www.briggsandstratton.com/us/en/support/maintenance-how-to/push-mower-engines/tune-up-schedule"]
[null,"8 http://www.basco.com/Sustainability/Reducing%20Mower%20Emissions/"]
[null,"9 http://www.kdheks.gov/bar/air_outreach/calc.html"]
[null,"10 http://www.briggsandstratton.com/us/en/support/faqs/servicing-air-cleaners"]
[null,"11 http://www.basco.com/Sustainability/Reducing%20Mower%20Emissions/"]
[null,"12 http://cleanairlawncare.com/sustainable-lawn-mowing-tips/"]

{"sheet":"Mowing","index":11,"n_rows":94,"n_cols":3,"rows_kept":94,"cut":false,"hidden":false,"merged":[[70,2,71,10],[79,2,81,10],[82,2,85,10],[86,2,89,10],[75,1,78,10],[67,2,69,10],[14,1,15,11],[8,1,9,11],[32,1,39,10],[27,2,30,10],[44,2,45,10],[47,2,53,10],[20,2,22,10],[17,2,19,10],[24,2,26,10],[41,2,42,10],[55,2,58,5],[60,2,62,5]]}
[]
[null,"Mowing Practices"]
[]
[]
[]
[null,"Mowing Practices"]
[]
[]
[null,"Proper mowing practices will result in a lawn that is visually appealing, healthy and resilient while decreasing the need to apply herbicides and providing an inviting location for recreational activities."]
[]
[]
[null,"Best Practices and Benefits by Category1"]
[]
[null,"Height"]
[null,"Proper lawn length has many benefits including increasing the lawn’s resilience to stressors, lessening time spent maintaining the lawn and reducing herbicide application."]
[]
[]
[null,"1.","As a best practice, lawns should generally be kept at 2.5 to 3 inches in height though optimal length varies by grass type.2  To measure lawn height, slide a ruler through the grass until it touches the underlying soil surface and check the grass blade height on the front of the ruler."]
[]
[]
[null,null,"Benefits: Maintaining a lawn of proper height can limit the need to apply herbicides by controlling the weeds through natural means.  Lawns with greater height lessen the light that reaches the soil surface, which can limit weed growth since many weed seeds require direct sunlight to germinate. "]
[]
[]
[]
[null,"2.","As a best practice, consider increasing lawn height in summer months especially during prolonged dry periods.  Increased lawn heights will increase the lawn’s ability to tolerate stress caused by heat and dry winds."]
[]
[]
[null,null,"Benefits: Lawns with higher heights generally also have greater root depth, which increases their ability to infiltrate water more quickly, and increases their access to nutrients and water found within the soil.  Increased access to nutrients and water helps to keep the plant healthy and resilient to pests, dry weather, and other stressors."]
[]
[]
[]
[null,"Frequency"]
[null,"The frequency at which you mow a lawn depends entirely on how fast the grass is growing.  In Pennsylvania, lawns tend to grow more quickly in the spring when temperatures are moderate and precipitation levels are higher.  Lawn growth rate tends to decrease in hotter summer months; however, this varies year-to-year depending on actual temperature and precipitation levels. Typically mowing frequency should slow in mid-to-late fall as cooler temperatures slow plant growth. Generally, mowing should stop in Pennsylvania around late October when growth stops; however, the timing will vary year-to-year based on weather conditions.  Ideally, grass should be mowed at the end of the season to prevent having long grass (which is susceptible to snow mold and meadow voles) during winter months.   "]
[]
[]
[]
[]
[]
[]
[]
[]
[null,"1.","As a best practice, mowing frequency should be based on the length of the lawn rather than the number of days that have passed since the lawn was last mowed.  "]
[]
[]
[null,null,"As a best practice, no more than 1/3 of the grass blade should be removed during a cut.  As an example, you should not cut more than 1 inch off a lawn that is 3 inches in length."]
[]
[]
[null,null,"Benefits:  Lawns that are mowed at proper intervals will be healthier and will be more visually appealing due to decreased scalping, which is excess removal of green plant tissue while mowing.  Lawns that are mowed too frequently may not have sufficient time to grow green plant tissue while lawns that are allowed to grow too long may have too much green leaf tissue removed during the cut.  Cutting too low will expose leaf tissue that appears yellow because it lacks chlorophyll.  Grass that has been cut too low will need to use food reserves to grow plant tissue that contains chlorophyll before it is able to grow normally.  This lessens the plant’s resilience to pests and other stressors and can promote weed growth."]
[]
[]
[]
[]
[]
[]
[]
[null,"2.","As a best practice, no more than 1/3 of the grass blade should be removed during a cut.  As an example, you should not cut more than 1 inch off a lawn that is 3.5 inches in length. "]
[]
[]
[]
[]
[null,null,"The picture to the right demonstrates a lawn that has been “scalped” (i.e. too much of the leaf tissue has been removed).  "]
[]
[]
[]
[null,"Direction"]
[null,"If possible, mowing direction should vary from cut to cut. "]
[]
[null,"1.","As a best practice, if possible, mow at a right angle to the previous cut.  This may not be possible depending on topography.  Push mowers should be used side-to-side on a hill and riding mowers should be used up and down a hill."]
[]
[]
[null,null,"Benefits: Alternating mowing direction promotes upright shoot growth, prevents scalping, and reduces soil compaction."]
[]
[]
[null,"Education and Outreach3"]
[]
[null,"Locations that implement mowing best practices may face scrutiny from individuals who have different lawn care expectations—this is particularly true for lawn height.  Therefore, some locations may benefit from providing the public with information on lawn care practices.  The following bullets may be beneficial for education and outreach purposes:"]
[]
[]
[]
[null,null,"• Not all grass is the same.  Most grass types used in lawns should be kept at 2.5 to 3 inches in height.  This height promotes deep roots which provide access to nutrients and water and help the grass resist pests and tolerate dry weather."]
[]
[]
[null,null,"• Leave the buzzcut at the links. Golf courses use specific types of grasses, such as Tifdwarf Bermudagrass and Creeping Bentgrass that tolerate very low heights.  While aesthetically beautiful, these grasses require considerable maintenance.  Similar heights are not appropriate for most lawns that use different grass types."]
[]
[]
[]
[null,null,"• Shade out the weeds.  Longer grass can help to prevent weed growth by preventing sunlight from reaching the ground where weed seeds are waiting to grow.  This natural approach to preventing weeds reduces the need to apply herbicides, which can make their way into streams and other waterways. "]
[]
[]
[]
[]
[null,"1 http://www.extension.umn.edu/garden/landscaping/maint/maint.htm"]
[null,"2 http://tinicumconservancy.org/pdfs/Environmentally%20Friendly%20Lawn.pdf"]
[null,"3. http://www.lawn-care-academy.com/grass-cutting-height.html"]

{"sheet":"Native Vegetation (2)","index":12,"n_rows":98,"n_cols":3,"rows_kept":98,"cut":false,"hidden":false,"merged":[[42,1,45,10],[8,1,17,6],[22,1,23,10],[26,2,28,10],[31,2,33,10],[36,2,39,10],[76,2,79,10],[83,1,89,10],[48,2,50,10],[52,2,53,10],[54,2,58,10],[61,2,62,10],[65,1,67,10],[70,2,72,10]]}
[]
[null,"Native Vegetation"]
[]
[]
[]
[null,"Native Vegetation"]
[]
[]
[null,"Native vegetation includes those plants that are endemic to the local environment and are thus well adapted to local features such as climate, soil, and water availability.1   Landscaping with native plants can lessen the need for pesticides and herbicides, reduce demand for water, and increase the types and number of species in the area.  Additionally, designing with a variety of native trees, shrubs, grasses and wildflowers can require less money and maintenance than conventional landscapes.2"]
[]
[]
[]
[]
[]
[]
[]
[]
[]
[]
[null,"Best Practices and Benefits by Category"]
[]
[null,"Habitat Expansion3"]
[null,"Pennsylvania wildlife has evolved to exist among native Pennsylvania plant species.  Using native vegetation establishes plant communities that are familiar and beneficial to local wildlife.  "]
[]
[]
[null,"1.","As a best practice, group trees, shrubs, and perennials together to create layers of vegetation. "]
[null,null,"Benefits: Plants are one of the most important features of an animal’s habitat since they provide a variety of habitat needs. Creating layers of vegetation provides the structure and plant variety needed for shelter, breeding, and nesting.  "]
[]
[]
[]
[null,"2.","As a best practice, create puddles, pools, or a small pond to provide water year-round. "]
[null,null,"Benefits:  Puddles, pools, and ponds provide a year-round source of water to animals while becoming a home to amphibians and aquatic insects. Running or circulating water will attract wildlife and prevent mosquito growth.  "]
[]
[]
[]
[null,"3.","As a best practice, provide a variety of natural areas for insects, birds, and small mammals. "]
[null,null,"Benefits: Providing a variety of native vegetation will support micro-ecosystems by attracting diverse animals and insects.  Incorporating rock walls or piles, stacked wood, or brush piles provide homes for insects, certain birds and small mammals.  Additionally, standing dead tree trunks benefit cavity-nesting wildlife such as woodpeckers.  "]
[]
[]
[]
[]
[null,"Landscape Resiliency"]
[null,"Native vegetation is generally better adapted to regional characteristics, such as amount of sunlight, temperature, water, and soil acidity.  Native plans are often tolerant of local climatic conditions and therefore require less irrigation.  They can also be better than non-native species at uptaking nutrients from the soil, which requires less fertilizer application.  "]
[]
[]
[]
[]
[null,"1.","As a best practice, choose plants that will grow well at the specific site.4"]
[null,null,"Benefits: When landscaping with native vegetation it is important to choose plants that will grow well at the site.  Consider moisture, wet or dry, amount of direct sunlight, shade or sunlight, and type of soil, acid or neutral."]
[]
[]
[]
[null,"2.","As a best practice, don’t over fertilize native plants.  If necessary, apply a slow-release organic fertilizer once a year in the fall.5"]
[]
[null,null,"Benefits: Most native plants will not need fertilizer once they are established.  When fertilizers are used, it is best practice to use organic or slow-release varieties, and should be used in as small a quantity as possible.  Reducing application of fertilizers decreases costs for lawn maintenance and decreases the amount of fertilizer that enters local waterways.  Too much fertilizer in rivers, lakes, and ponds can lead to excessive amounts of algae and eutrophication, which can kill fish and other animals due to depleted oxygen levels."]
[]
[]
[]
[]
[]
[null,"3.","As a best practice, protect and maintain existing trees.6"]
[null,null,"Benefits: Mature trees enhance air quality and reduce pollution, enhance water quality and reduce erosion, and can reduce energy costs when properly planted around a building."]
[]
[]
[null,"Weed Control7"]
[null,"Once established native plants suppress weeds by outcompeting them for soil nutrients, groundspace, and sunlight.  As a result, native plants lessen the need to apply herbicides and pesticides.  Native vegetation can also be used to address areas with problems such as erosion, steep slopes, or poor drainage."]
[]
[]
[]
[null,"1.","As a best practice, spot spray herbicides."]
[null,null,"Benefits: Spot spraying weeds—by targeting weeds that require herbicide application as opposed to blanket herbicide application—cuts down on the amount of herbicide that needs to be applied.  This saves money and lessens environmental impacts associated with herbicide use. "]
[]
[]
[null,null,"Note: carefully read and follow the manufacturer’s mixing and application directions."]
[]
[null,"2.","As a best practice, use native vegetation on slopes that may be difficult to mow."]
[null,null,"Benefits:  Native vegetation grown on steep slopes can stabilize the soil while eliminating the need to mow challenging or dangerous areas.  Those native species that have dense and deep root systems (such as native grasses) prevent soil erosion and slop failure and prevent weeds from otherwise growing in these areas."]
[]
[]
[]
[]
[null,"Education and Outreach"]
[]
[null,"The general public and other stakeholders may express concerns over the use of native vegetation as opposed to conventional lawns.  To increase awareness of the benefits of native vegetation, localities can provide interpretive kiosks and other materials that highlight the types of insects and animals that may exist among the native plants that otherwise would not be present.  Interpretive materials could also note the reduced need for herbicides, pesticides, and fertilizer and the associated benefits to local water quality and species diversity.  Additionally, localities could host bug catch-and-release events to highlight the variety and diversity of species found among the native vegetation."]
[]
[]
[]
[]
[]
[]
[]
[null,"1  Native plants are distinct from non-native plants, which have been brought into the local environment from other locations by human activity."]
[null,"2 http://www.nps.gov/plants/pubs/chesapeake/pdf/chesapeakenatives.pdf"]
[null,"3 http://www.dcnr.state.pa.us/forestry/plants/nativeplants/index.htm "]
[null,"4 http://www.dcnr.state.pa.us/forestry/plants/nativeplants/index.htm"]
[null,"5 http://www.dcnr.state.pa.us/cs/groups/public/documents/document/dcnr_006236.pdf"]
[null,"6 http://www.dcnr.state.pa.us/cs/groups/public/documents/document/dcnr_006236.pdf"]
[null,"7 http://www.lrrb.org/media/reports/200820.pdf"]

{"sheet":"Grasscycling (2)","index":13,"n_rows":76,"n_cols":3,"rows_kept":76,"cut":false,"hidden":false,"merged":[[64,2,65,11],[8,1,12,11],[17,1,18,10],[21,2,23,10],[26,2,28,10],[31,1,34,10],[37,2,40,10],[43,2,47,10],[50,2,51,10],[53,2,54,10],[55,2,57,11],[60,2,61,10]]}
[]
[null,"Grasscycling"]
[]
[]
[]
[null,"Grasscycling"]
[]
[]
[null,"Grasscycling is the practice of leaving grass clippings on the lawn rather than bagging and disposing of them.  Grass clippings are mostly composed of leaf tissue and thus decompose rapidly.  Grass clippings can contribute a substantial amount of nitrogen and other nutrients to the soil, which fertilizes the lawn naturally.  Any well-maintained lawn mower is capable of grasscycling.   Grasscycling reduces waste and fertilizer use, eliminates time spent bagging, and makes lawns healthier and more resilient."]
[]
[]
[]
[]
[]
[null,"Best Practices and Benefits by Category"]
[]
[null,"Reduced Waste1"]
[null,"Grasscycling reduces the amount of waste sent to the landfill, which can cut down on disposal costs and reduce landfilled waste."]
[]
[]
[null,"1.","As a best practice, cut grass when it is dry. "]
[null,null,"Benefits: Clumping can occur if grass is too moist when mowed, which encourages bagging for disposal.  Consider an alternative use for clumps and place them around trees and shrubs as mulch.  Cut grass when it is dry so the clippings will scatter rather than clump, or run the mower back over any clumps.2"]
[]
[]
[]
[null,"2.","As a best practice, keep the mower blades sharp.3"]
[null,null,"Benefits: Sharp blades result in shorter grass clippings, which promote faster decomposition rates and can produce an attractive and healthy lawn. Shorter grass clippings also hide better, discouraging bagging.4"]
[]
[]
[]
[null,"Reduced Fertilizer Use5"]
[null,"Proper fertilization is essential in maintaining a healthy lawn. However, applying too much fertilization can cause excessive top growth.  Grass clippings left on the lawn can increase the amount of nutrients absorbed by the lawn and thereby reduce the amount of fertilizer needed to maintain a healthy and green space."]
[]
[]
[]
[]
[null,"1.","As a best practice, know your soil."]
[null,null,"Benefits: If you are applying fertilizer to your lawn without first understanding your soil’s requirements, you are probably wasting your hard-earned money. Contact your County Cooperative Extension Office or Penn State’s Agricultural Services Lab for a soil test kit and learn about your lawn soil’s strengths and weaknesses. "]
[]
[]
[]
[]
[null,"2.","As a best practice, timing is everything. "]
[null,null,"Benefits: If you are going to apply a fertilizer the ideal periods for application take place between the last lawn mowing and Thanksgiving and the first two weeks in September, when fertilizer will feed the roots, not the leaves.  Spring fertilization encourages leaf growth and feeds weed species.  If you must fertilize in the spring, do it in early May.  Never fertilize in the summer.  Most lawn grasses are cool season species, which die back during the heat of the summer."]
[]
[]
[]
[]
[]
[null,"3.","As a best practice, use fertilizers that contain slow-release nitrogen.7"]
[null,null,"Benefits: Slow-release nitrogen fertilizers promote slower, more uniform growth.  Recommended types include methylene urea, ureaformaldehyde, sulfur-coated urea, or isobutylidene diurea (IBDU). "]
[]
[]
[null,"4.","As a best practice, apply smaller quantities of fertilizer more frequently rather than larger amounts less frequently."]
[]
[null,null,"Benefits: Most grasses need modest amounts of fertilizer.  Those that benefit from grasscycling require less fertilizer than those lawns where grass clippings are removed. Decreasing the amount of fertilizer per application can increase the absorption of nutrients into the soil.  "]
[]
[]
[]
[null,"5.","As a best practice, leave grass clippings on the lawn to recycle plant nutrients back into the soil.8"]
[null,null,"Benefits: Grass clippings contain the same beneficial nitrogen, phosphorus, and potassium nutrients as fertilizer. Clippings can provide up to one-third of the annual feeding requirement for your lawn if your soil already contains the proper amount of nutrients."]
[]
[]
[null,"6.","As a best practice, cut up to one-third of the height to reduce water loss from evaporation.9"]
[null,null,"Benefits:  Maintaining the proper length on your lawn produces grass clippings that help conserve water because the grass clippings left on the lawn reduce water loss from evaporation by keeping the soil cool. "]
[]
[]
[null,"1 http://www.extension.umn.edu/garden/landscaping/maint/maint.htm"]
[null,"2 http://www.frederickcountymd.gov/index.aspx?NID=566"]
[null,"3 http://www.dep.state.pa.us/dep/deputate/airwaste/wm/recycle/document/letitlay.htm"]
[null,"4 http://www.calgary.ca/UEP/WRS/Pages/Recycling-information/Residential-services/Organics-recycling/Grasscycling.aspx"]
[null,"5 http://www.calrecycle.ca.gov/organics/grasscycling/HowTo.htm"]
[null,"6 http://tinicumconservancy.org/pdfs/Environmentally%20Friendly%20Lawn.pdf "]
[null,"7 http://www.dep.state.pa.us/dep/deputate/airwaste/wm/recycle/document/letitlay.htm"]
[null,"8 http://ofswcd.org/files/Download/Backyard%20Conservation%20Lawn%20Care%20Practices%20speaker%20notes%20Final.pdf"]
[null,"9 http://www.baltimorecountymd.gov/Agencies/publicworks/recycling/composting/grasscycling.html"]

{"sheet":"Maintenance (2)","index":14,"n_rows":89,"n_cols":3,"rows_kept":89,"cut":false,"hidden":false,"merged":[[27,2,29,10],[8,1,9,10],[14,1,15,10],[17,2,18,10],[19,2,23,10],[25,2,26,10],[67,2,69,10],[72,2,75,10],[32,2,35,10],[38,1,42,10],[45,2,47,10],[50,2,53,10],[56,1,58,10],[62,2,64,10]]}
[]
[null,"Mower Maintenance"]
[]
[]
[]
[null,"Mower Maintenance"]
[]
[]
[null,"Proper mower maintenance will result in decreased mower emissions (carbon and other pollutants), reduced fuel consumption, extended lifetime of the equipment, and improved local air quality. "]
[]
[]
[null,"Best Practices and Benefits by Category"]
[]
[null,"Fuel Use Tips1"]
[null,"Proper mower refueling practices has many benefits including reduced fuel consumption and minimizing storm water pollution."]
[]
[]
[null,"1.","As a best practice, check the oil level regularly and only fill the fuel tank three-quarters full, allowing room for expansion without overflow.  "]
[]
[null,null,"Benefits: Ideally, you should check the oil level every time you mow. If you have a new mower, change the oil after the first five hours of use. After that, change the oil after every 50 hours of use or at the beginning of each lawn care season.2  Knowing your oil level will also help in avoiding overflow of your fuel tank. When fueling lawn and garden equipment use a funnel and pour slowly.3  The avoidance of overflowed fuel will also reduce storm water pollution.4"]
[]
[]
[]
[]
[]
[null,"2.","As a best practice, close the fuel container’s vent and keep gas cans out of direct sunlight to reduce fuel evaporation. "]
[]
[null,null,"Benefits: At high heat, such as in summer months, gas can evaporate from the fuel container if it is poorly fitted or sealed.5  Be sure to check that your fuel tank cap is properly closed and avoid storing your gas can in direct sunlight."]
[]
[]
[]
[null,"3.","As a best practice, do not use old fuel or fuel that has sat all winter without a stabilizer in it. "]
[null,null,"Benefits: Add a stabilizer (fuel preserver) according to package directions and run the mower for a few minutes so the stabilizer circulates through the carburetor.  The stabilizer keeps fuel fresh for up to 6 months.  When storing your mower for the winter, fill the tank.  This will help prevent moisture from condensing in the tank which can form rust that could break away and clog the carburetor.  "]
[]
[]
[]
[]
[null,"Lower Carbon Footprint"]
[null,"Implementing best practices for mower maintenance can lead to decreased mower emissions and fuel consumption. These tips can reduce the amount of carbon and pollutants affecting air quality. For example, gasoline powered lawn mowers contribute to local air pollution.  Therefore modifications to how you refuel your lawn mower and frequency of tune-ups can result in lowering the carbon impact of lawn mowers.   "]
[]
[]
[]
[]
[]
[null,"1.","As a best practice, use high quality detergent oil, such as 30MW or 10W-30, to reduce emissions.6"]
[null,null,"Benefits: Burning higher quality detergent oil can reduce damage to the converter, resulting in lower emissions and more efficient machinery.  A reduction in emissions lowers the carbon footprint of the activity, decreasing the amount of pollutants entering the air. "]
[]
[]
[]
[null,"2.","As a best practice, keep the mower engine properly tuned. "]
[null,null,"Benefits:  Regular tune-ups can add years to a mower and help reduce a mower’s emissions up to 50 percent.  Also, more horsepower can be applied to cutting the grass instead of running an inefficient engine.  Tune-ups can include checking the oil level, changing oil, replacing air and oil filters, and replacing spark plugs.7"]
[]
[]
[]
[]
[null,"Wear and Tear8"]
[null,"Regular maintenance of lawn equipment can reduce gasoline consumption and extend the lifetime of the equipment. Proper maintenance can include replacing air filters, changing oil, and sharpening mower blades. These practices can also increase equipment efficiency and reduce associated emissions.9"]
[]
[]
[null,"Refer to your mower’s user manual for specific guidelines."]
[]
[null,"1.","As a best practice, clean or replace the air filter after 25 hours of use or every season.10"]
[null,null,"Benefits: The air filter prevents dirt, dust, and grass clippings from entering the carburetor and engine. , where debris can create excess wear on engine parts or reduce engine power. If you operate under dusty or heavy load conditions, consider cleaning or replacing the air filter more frequently. "]
[]
[]
[]
[null,"2.","As a best practice, change the engine oil after 20-25 hours of use.11"]
[null,null,"Benefits: Changing the oil of your lawn mower is critical to its long term performance. Clean, fresh oil will help an engine start quickly and operate more efficiently. Remember to recycle the old oil to a certified oil recycling center or refer to your community’s disposal guidelines. "]
[]
[]
[]
[null,"3.","As a best practice, keep the mower blade sharp and the underside of the deck clean.12"]
[null,null,"Benefits: Dull mower blades can cut inconsistently, unevenly, or it may not cut at all. Additionally, dull blades can cause leaf tips to become frayed and cause grass to become more susceptible to disease, insects, and weeds.  In addition, sharp blades help extend the life of the mower because the engine will not have to work as hard to produce the same results. "]
[]
[]
[]
[]
[null,"1 http://www.basco.com/Sustainability/Reducing%20Mower%20Emissions/"]
[null,"2 http://www.briggsandstratton.com/us/en/support/maintenance-how-to/push-mower-engines/how-to-maintain-your-mower-engine"]
[null,"3 http://www.kdheks.gov/bar/air_outreach/calc.html"]
[null,"4 http://greenscapes.org/?page_id=220"]
[null,"5 http://drivesmarterchallenge.org/money-saving-tips/myths.aspx"]
[null,"6 http://www.precisionenginetech.com/tech-explained/2009/06/01/choosing-the-right-oil-part-1/"]
[null,"7 http://www.briggsandstratton.com/us/en/support/maintenance-how-to/push-mower-engines/tune-up-schedule"]
[null,"8 http://www.basco.com/Sustainability/Reducing%20Mower%20Emissions/"]
[null,"9 http://www.kdheks.gov/bar/air_outreach/calc.html"]
[null,"10 http://www.briggsandstratton.com/us/en/support/faqs/servicing-air-cleaners"]
[null,"11 http://www.basco.com/Sustainability/Reducing%20Mower%20Emissions/"]
[null,"12 http://cleanairlawncare.com/sustainable-lawn-mowing-tips/"]

{"sheet":"Mowing (2)","index":15,"n_rows":94,"n_cols":3,"rows_kept":94,"cut":false,"hidden":false,"merged":[[27,2,30,10],[8,1,9,11],[14,1,15,11],[17,2,19,10],[20,2,22,10],[24,2,26,10],[86,2,89,10],[32,1,39,10],[41,2,42,10],[44,2,45,10],[47,2,53,10],[55,2,58,5],[60,2,62,5],[67,2,69,10],[70,2,71,10],[75,1,78,10],[79,2,81,10],[82,2,85,10]]}
[]
[null,"Mowing Practices"]
[]
[]
[]
[null,"Mowing Practices"]
[]
[]
[null,"Proper mowing practices will result in a lawn that is visually appealing, healthy and resilient while decreasing the need to apply herbicides and providing an inviting location for recreational activities."]
[]
[]
[null,"Best Practices and Benefits by Category1"]
[]
[null,"Height"]
[null,"Proper lawn length has many benefits including increasing the lawn’s resilience to stressors, lessening time spent maintaining the lawn and reducing herbicide application."]
[]
[]
[null,"1.","As a best practice, lawns should generally be kept at 2.5 to 3 inches in height though optimal length varies by grass type.2  To measure lawn height, slide a ruler through the grass until it touches the underlying soil surface and check the grass blade height on the front of the ruler."]
[]
[]
[null,null,"Benefits: Maintaining a lawn of proper height can limit the need to apply herbicides by controlling the weeds through natural means.  Lawns with greater height lessen the light that reaches the soil surface, which can limit weed growth since many weed seeds require direct sunlight to germinate. "]
[]
[]
[]
[null,"2.","As a best practice, consider increasing lawn height in summer months especially during prolonged dry periods.  Increased lawn heights will increase the lawn’s ability to tolerate stress caused by heat and dry winds."]
[]
[]
[null,null,"Benefits: Lawns with higher heights generally also have greater root depth, which increases their ability to infiltrate water more quickly, and increases their access to nutrients and water found within the soil.  Increased access to nutrients and water helps to keep the plant healthy and resilient to pests, dry weather, and other stressors."]
[]
[]
[]
[null,"Frequency"]
[null,"The frequency at which you mow a lawn depends entirely on how fast the grass is growing.  In Pennsylvania, lawns tend to grow more quickly in the spring when temperatures are moderate and precipitation levels are higher.  Lawn growth rate tends to decrease in hotter summer months; however, this varies year-to-year depending on actual temperature and precipitation levels. Typically mowing frequency should slow in mid-to-late fall as cooler temperatures slow plant growth. Generally, mowing should stop in Pennsylvania around late October when growth stops; however, the timing will vary year-to-year based on weather conditions.  Ideally, grass should be mowed at the end of the season to prevent having long grass (which is susceptible to snow mold and meadow voles) during winter months.   "]
[]
[]
[]
[]
[]
[]
[]
[]
[null,"1.","As a best practice, mowing frequency should be based on the length of the lawn rather than the number of days that have passed since the lawn was last mowed.  "]
[]
[]
[null,null,"As a best practice, no more than 1/3 of the grass blade should be removed during a cut.  As an example, you should not cut more than 1 inch off a lawn that is 3 inches in length."]
[]
[]
[null,null,"Benefits:  Lawns that are mowed at proper intervals will be healthier and will be more visually appealing due to decreased scalping, which is excess removal of green plant tissue while mowing.  Lawns that are mowed too frequently may not have sufficient time to grow green plant tissue while lawns that are allowed to grow too long may have too much green leaf tissue removed during the cut.  Cutting too low will expose leaf tissue that appears yellow because it lacks chlorophyll.  Grass that has been cut too low will need to use food reserves to grow plant tissue that contains chlorophyll before it is able to grow normally.  This lessens the plant’s resilience to pests and other stressors and can promote weed growth."]
[]
[]
[]
[]
[]
[]
[]
[null,"2.","As a best practice, no more than 1/3 of the grass blade should be removed during a cut.  As an example, you should not cut more than 1 inch off a lawn that is 3.5 inches in length. "]
[]
[]
[]
[]
[null,null,"The picture to the right demonstrates a lawn that has been “scalped” (i.e. too much of the leaf tissue has been removed).  "]
[]
[]
[]
[null,"Direction"]
[null,"If possible, mowing direction should vary from cut to cut. "]
[]
[null,"1.","As a best practice, if possible, mow at a right angle to the previous cut.  This may not be possible depending on topography.  Push mowers should be used side-to-side on a hill and riding mowers should be used up and down a hill."]
[]
[]
[null,null,"Benefits: Alternating mowing direction promotes upright shoot growth, prevents scalping, and reduces soil compaction."]
[]
[]
[null,"Education and Outreach3"]
[]
[null,"Locations that implement mowing best practices may face scrutiny from individuals who have different lawn care expectations—this is particularly true for lawn height.  Therefore, some locations may benefit from providing the public with information on lawn care practices.  The following bullets may be beneficial for education and outreach purposes:"]
[]
[]
[]
[null,null,"• Not all grass is the same.  Most grass types used in lawns should be kept at 2.5 to 3 inches in height.  This height promotes deep roots which provide access to nutrients and water and help the grass resist pests and tolerate dry weather."]
[]
[]
[null,null,"• Leave the buzzcut at the links. Golf courses use specific types of grasses, such as Tifdwarf Bermudagrass and Creeping Bentgrass that tolerate very low heights.  While aesthetically beautiful, these grasses require considerable maintenance.  Similar heights are not appropriate for most lawns that use different grass types."]
[]
[]
[]
[null,null,"• Shade out the weeds.  Longer grass can help to prevent weed growth by preventing sunlight from reaching the ground where weed seeds are waiting to grow.  This natural approach to preventing weeds reduces the need to apply herbicides, which can make their way into streams and other waterways. "]
[]
[]
[]
[]
[null,"1 http://www.extension.umn.edu/garden/landscaping/maint/maint.htm"]
[null,"2 http://tinicumconservancy.org/pdfs/Environmentally%20Friendly%20Lawn.pdf"]
[null,"3. http://www.lawn-care-academy.com/grass-cutting-height.html"]